BDBM24499 3-(4-{[2-(1-ethyl-1H-imidazol-4-yl)thieno[3,2-b]pyridin-7-yl]oxy}-3-fluorophenyl)-1-(2-phenylacetyl)thiourea::thieno[3,2-b]pyridine-based inhibitor, 10b
SMILES: CCn1cnc(c1)-c1cc2nccc(Oc3ccc(NC(=S)NC(=O)Cc4ccccc4)cc3F)c2s1
InChI Key: InChIKey=OWHNQRWVPROBIY-UHFFFAOYSA-N
Data: 3 IC50
Activity Spreadsheet -- Enzyme Inhibition Constant Data from BindingDB
Found 3 hits for monomerid = 24499
Trg + Lig
Ki
nM
ΔG°
kcal/mole
IC50
nM
Kd
nM
EC50/IC50
nM
koff
s-1
kon
M-1s-1
pHTemp
°C
Hepatocyte growth factor receptor
(Homo sapiens (Human))
BDBM24499
(3-(4-{[2-(1-ethyl-1H-imidazol-4-yl)thieno[3,2-b]py...)
Show SMILES CCn1cnc(c1)-c1cc2nccc(Oc3ccc(NC(=S)NC(=O)Cc4ccccc4)cc3F)c2s1
Show InChI InChI=1S/C27H22FN5O2S2/c1-2-33-15-21(30-16-33)24-14-20-26(37-24)23(10-11-29-20)35-22-9-8-18(13-19(22)28)31-27(36)32-25(34)12-17-6-4-3-5-7-17/h3-11,13-16H,2,12H2,1H3,(H2,31,32,34,36)
n/an/a 52n/an/an/an/a7.530
MethylGene Inc.
Assay Description
Inhibition of kinase activity was measured in a DELFIA assay (Perkin-Elmer). The substrate poly (Glu4, Tyr) was immobilized onto black high-binding p...
Bioorg Med Chem Lett 18: 2793-8 (2008)
Article DOI: 10.1016/j.bmcl.2008.04.009
BindingDB Entry DOI: 10.7270/Q25X2778
Hepatocyte growth factor receptor
(Homo sapiens (Human))
BDBM24499
(3-(4-{[2-(1-ethyl-1H-imidazol-4-yl)thieno[3,2-b]py...)
Show SMILES CCn1cnc(c1)-c1cc2nccc(Oc3ccc(NC(=S)NC(=O)Cc4ccccc4)cc3F)c2s1
Show InChI InChI=1S/C27H22FN5O2S2/c1-2-33-15-21(30-16-33)24-14-20-26(37-24)23(10-11-29-20)35-22-9-8-18(13-19(22)28)31-27(36)32-25(34)12-17-6-4-3-5-7-17/h3-11,13-16H,2,12H2,1H3,(H2,31,32,34,36)
n/an/a 52n/an/an/an/an/an/a
Sichuan University
Curated by ChEMBL
Assay Description
Inhibition of human c-MET
Eur J Med Chem 46: 3675-80 (2011)
Article DOI: 10.1016/j.ejmech.2011.05.031
BindingDB Entry DOI: 10.7270/Q2891676
Vascular endothelial growth factor receptor 2
(Homo sapiens (Human))
BDBM24499
(3-(4-{[2-(1-ethyl-1H-imidazol-4-yl)thieno[3,2-b]py...)
Show SMILES CCn1cnc(c1)-c1cc2nccc(Oc3ccc(NC(=S)NC(=O)Cc4ccccc4)cc3F)c2s1
Show InChI InChI=1S/C27H22FN5O2S2/c1-2-33-15-21(30-16-33)24-14-20-26(37-24)23(10-11-29-20)35-22-9-8-18(13-19(22)28)31-27(36)32-25(34)12-17-6-4-3-5-7-17/h3-11,13-16H,2,12H2,1H3,(H2,31,32,34,36)
NCI pathway
Reactome pathway
n/an/a 11n/an/an/an/an/an/a
MethylGene Inc.
Assay Description
Inhibition of kinase activity was measured in a DELFIA assay (Perkin-Elmer). The substrate poly (Glu4, Tyr) was immobilized onto black high-binding p...
Bioorg Med Chem Lett 18: 2793-8 (2008)
Article DOI: 10.1016/j.bmcl.2008.04.009
BindingDB Entry DOI: 10.7270/Q25X2778