null
SMILES: CN1CCN(CC1)c1ccc(cc1)-c1ccc2[nH]c3nccc(-c4ccc(cc4)C(=O)c4ccccc4)c3c2c1
InChI Key: InChIKey=VJSPNECZNBHJNW-UHFFFAOYSA-N
Activity Spreadsheet -- Enzyme Inhibition Constant Data from BindingDB
Found 2 hits for monomerid = 245229
Trg + Lig
Ki
nM
ΔG°
kcal/mole
IC50
nM
Kd
nM
EC50/IC50
nM
koff
s-1
kon
M-1s-1
pHTemp
°C
ALK tyrosine kinase receptor [L1196M]
(Homo sapiens (Human))
BDBM245229
(US9428500, 23)
Show SMILES CN1CCN(CC1)c1ccc(cc1)-c1ccc2[nH]c3nccc(-c4ccc(cc4)C(=O)c4ccccc4)c3c2c1
Show InChI InChI=1S/C35H30N4O/c1-38-19-21-39(22-20-38)29-14-11-24(12-15-29)28-13-16-32-31(23-28)33-30(17-18-36-35(33)37-32)25-7-9-27(10-8-25)34(40)26-5-3-2-4-6-26/h2-18,23H,19-22H2,1H3,(H,36,37)
US Patent
n/an/a 150n/an/an/an/a7.530
UNIVERSITA DEGLI STUDI DI MILANO—BICOCCA; UNIVERSITE DE GENEVE; UNIVERSITE CLAUDE BERNARD—LYON
US Patent
Assay Description
GST-tagged recombinant wild-type or L1196M mutated ALK kinase (rALK) was expressed in Sf9 insect cells using the pBacPAK baculovirus vector system (C...
US Patent US9428500 (2016)
BindingDB Entry DOI: 10.7270/Q2CR5S8M
ALK tyrosine kinase receptor
(Homo sapiens (Human))
BDBM245229
(US9428500, 23)
Show SMILES CN1CCN(CC1)c1ccc(cc1)-c1ccc2[nH]c3nccc(-c4ccc(cc4)C(=O)c4ccccc4)c3c2c1
Show InChI InChI=1S/C35H30N4O/c1-38-19-21-39(22-20-38)29-14-11-24(12-15-29)28-13-16-32-31(23-28)33-30(17-18-36-35(33)37-32)25-7-9-27(10-8-25)34(40)26-5-3-2-4-6-26/h2-18,23H,19-22H2,1H3,(H,36,37)
US Patent
n/an/a 610n/an/an/an/a7.530
UNIVERSITA DEGLI STUDI DI MILANO—BICOCCA; UNIVERSITE DE GENEVE; UNIVERSITE CLAUDE BERNARD—LYON
US Patent
Assay Description
GST-tagged recombinant wild-type or L1196M mutated ALK kinase (rALK) was expressed in Sf9 insect cells using the pBacPAK baculovirus vector system (C...
US Patent US9428500 (2016)
BindingDB Entry DOI: 10.7270/Q2CR5S8M