null
SMILES: CN1CCN(CC1)c1ccc(cc1)-c1ccc2[nH]c3nccc(C#Cc4ccccc4)c3c2c1
InChI Key: InChIKey=TWGIZRMZIDZDGJ-UHFFFAOYSA-N
Activity Spreadsheet -- Enzyme Inhibition Constant Data from BindingDB
Found 2 hits for monomerid = 245243
Trg + Lig
Ki
nM
ΔG°
kcal/mole
IC50
nM
Kd
nM
EC50/IC50
nM
koff
s-1
kon
M-1s-1
pHTemp
°C
ALK tyrosine kinase receptor [L1196M]
(Homo sapiens (Human))
BDBM245243
(US9428500, 37)
Show SMILES CN1CCN(CC1)c1ccc(cc1)-c1ccc2[nH]c3nccc(C#Cc4ccccc4)c3c2c1
Show InChI InChI=1S/C30H26N4/c1-33-17-19-34(20-18-33)26-12-9-23(10-13-26)25-11-14-28-27(21-25)29-24(15-16-31-30(29)32-28)8-7-22-5-3-2-4-6-22/h2-6,9-16,21H,17-20H2,1H3,(H,31,32)
US Patent
n/an/a 130n/an/an/an/a7.530
UNIVERSITA DEGLI STUDI DI MILANO—BICOCCA; UNIVERSITE DE GENEVE; UNIVERSITE CLAUDE BERNARD—LYON
US Patent
Assay Description
GST-tagged recombinant wild-type or L1196M mutated ALK kinase (rALK) was expressed in Sf9 insect cells using the pBacPAK baculovirus vector system (C...
US Patent US9428500 (2016)
BindingDB Entry DOI: 10.7270/Q2CR5S8M
ALK tyrosine kinase receptor
(Homo sapiens (Human))
BDBM245243
(US9428500, 37)
Show SMILES CN1CCN(CC1)c1ccc(cc1)-c1ccc2[nH]c3nccc(C#Cc4ccccc4)c3c2c1
Show InChI InChI=1S/C30H26N4/c1-33-17-19-34(20-18-33)26-12-9-23(10-13-26)25-11-14-28-27(21-25)29-24(15-16-31-30(29)32-28)8-7-22-5-3-2-4-6-22/h2-6,9-16,21H,17-20H2,1H3,(H,31,32)
US Patent
n/an/a 170n/an/an/an/a7.530
UNIVERSITA DEGLI STUDI DI MILANO—BICOCCA; UNIVERSITE DE GENEVE; UNIVERSITE CLAUDE BERNARD—LYON
US Patent
Assay Description
GST-tagged recombinant wild-type or L1196M mutated ALK kinase (rALK) was expressed in Sf9 insect cells using the pBacPAK baculovirus vector system (C...
US Patent US9428500 (2016)
BindingDB Entry DOI: 10.7270/Q2CR5S8M