BDBM245295 US9428504, 33
SMILES: CC(C)(C)CN1CCC2(CN(c3c2c(F)ccc3O)c2ccccc2NC(=O)Nc2nc3ccc(Cl)cc3s2)CC1
InChI Key: InChIKey=MDAMHWWRFHRNML-UHFFFAOYSA-N
Data: 1 KI
Activity Spreadsheet -- Enzyme Inhibition Constant Data from BindingDB
Found 1 hit for monomerid = 245295
Trg + Lig
Ki
nM
ΔG°
kcal/mole
IC50
nM
Kd
nM
EC50/IC50
nM
koff
s-1
kon
M-1s-1
pHTemp
°C
Purinergic receptor P2Y1
(Homo sapiens (Human))
BDBM245295
(US9428504, 33)
Show SMILES CC(C)(C)CN1CCC2(CN(c3c2c(F)ccc3O)c2ccccc2NC(=O)Nc2nc3ccc(Cl)cc3s2)CC1
Show InChI InChI=1S/C31H33ClFN5O2S/c1-30(2,3)17-37-14-12-31(13-15-37)18-38(27-24(39)11-9-20(33)26(27)31)23-7-5-4-6-21(23)34-28(40)36-29-35-22-10-8-19(32)16-25(22)41-29/h4-11,16,39H,12-15,17-18H2,1-3H3,(H2,34,35,36,40)
US Patent
3.70 -11.5n/an/an/an/an/an/a25
Bristol-Myers Squibb Company
US Patent
Assay Description
Binding reactions were performed in WGA FLASHPLATEs (PerkinElmer Life Sciences, Cat # SMP105A) in a volume of 200 uL containing 45 fmol of P2Y1 recep...
US Patent US9428504 (2016)
BindingDB Entry DOI: 10.7270/Q24748SD