null
SMILES: Cc1nsc(NC(=O)Nc2ccccc2N2CC3(CCN(CC(C)(C)C)CC3)c3c2c(O)ccc3Cl)n1
InChI Key: InChIKey=XBWDEWYJIWXKKT-UHFFFAOYSA-N
Activity Spreadsheet -- Enzyme Inhibition Constant Data from BindingDB
Found 1 hit for monomerid = 245302
Trg + Lig
Ki
nM
ΔG°
kcal/mole
IC50
nM
Kd
nM
EC50/IC50
nM
koff
s-1
kon
M-1s-1
pHTemp
°C
P2Y purinoceptor 1
(Homo sapiens (Human))
BDBM245302
(US9428504, 42)
Show SMILES Cc1nsc(NC(=O)Nc2ccccc2N2CC3(CCN(CC(C)(C)C)CC3)c3c2c(O)ccc3Cl)n1
Show InChI InChI=1S/C27H33ClN6O2S/c1-17-29-25(37-32-17)31-24(36)30-19-7-5-6-8-20(19)34-16-27(22-18(28)9-10-21(35)23(22)34)11-13-33(14-12-27)15-26(2,3)4/h5-10,35H,11-16H2,1-4H3,(H2,29,30,31,32,36)
US Patent
3.30 -11.6n/an/an/an/an/an/a25
Bristol-Myers Squibb Company
US Patent
Assay Description
Binding reactions were performed in WGA FLASHPLATEs (PerkinElmer Life Sciences, Cat # SMP105A) in a volume of 200 uL containing 45 fmol of P2Y1 recep...
US Patent US9428504 (2016)
BindingDB Entry DOI: 10.7270/Q24748SD