BDBM245303 US9428504, 43
SMILES: CC(C)c1nsc(NC(=O)Nc2ccccc2N2CC3(CCN(CC(C)(C)C)CC3)c3c2c(O)ccc3Cl)n1
InChI Key: InChIKey=OSQQYUJHESONMI-UHFFFAOYSA-N
Data: 1 KI
Activity Spreadsheet -- Enzyme Inhibition Constant Data from BindingDB
Found 1 hit for monomerid = 245303
Trg + Lig
Ki
nM
ΔG°
kcal/mole
IC50
nM
Kd
nM
EC50/IC50
nM
koff
s-1
kon
M-1s-1
pHTemp
°C
Purinergic receptor P2Y1
(Homo sapiens (Human))
BDBM245303
(US9428504, 43)
Show SMILES CC(C)c1nsc(NC(=O)Nc2ccccc2N2CC3(CCN(CC(C)(C)C)CC3)c3c2c(O)ccc3Cl)n1
Show InChI InChI=1S/C29H37ClN6O2S/c1-18(2)25-32-27(39-34-25)33-26(38)31-20-8-6-7-9-21(20)36-17-29(23-19(30)10-11-22(37)24(23)36)12-14-35(15-13-29)16-28(3,4)5/h6-11,18,37H,12-17H2,1-5H3,(H2,31,32,33,34,38)
US Patent
4.40 -11.4n/an/an/an/an/an/a25
Bristol-Myers Squibb Company
US Patent
Assay Description
Binding reactions were performed in WGA FLASHPLATEs (PerkinElmer Life Sciences, Cat # SMP105A) in a volume of 200 uL containing 45 fmol of P2Y1 recep...
US Patent US9428504 (2016)
BindingDB Entry DOI: 10.7270/Q24748SD