BDBM245306 US9428504, 46
SMILES: CC(C)(C)CN1CCC2(CN(c3c2c(Cl)ccc3O)c2ccccc2NC(=O)Nc2nc3CCCc3s2)CC1
InChI Key: InChIKey=GEYVUPWHXBNEJF-UHFFFAOYSA-N
Data: 1 KI
Activity Spreadsheet -- Enzyme Inhibition Constant Data from BindingDB
Found 1 hit for monomerid = 245306
Trg + Lig
Ki
nM
ΔG°
kcal/mole
IC50
nM
Kd
nM
EC50/IC50
nM
koff
s-1
kon
M-1s-1
pHTemp
°C
Purinergic receptor P2Y1
(Homo sapiens (Human))
BDBM245306
(US9428504, 46)
Show SMILES CC(C)(C)CN1CCC2(CN(c3c2c(Cl)ccc3O)c2ccccc2NC(=O)Nc2nc3CCCc3s2)CC1
Show InChI InChI=1S/C30H36ClN5O2S/c1-29(2,3)17-35-15-13-30(14-16-35)18-36(26-23(37)12-11-19(31)25(26)30)22-9-5-4-7-20(22)32-27(38)34-28-33-21-8-6-10-24(21)39-28/h4-5,7,9,11-12,37H,6,8,10,13-18H2,1-3H3,(H2,32,33,34,38)
US Patent
6.20 -11.2n/an/an/an/an/a7.425
Bristol-Myers Squibb Company
US Patent
Assay Description
A SPA membrane binding assay was used to identify inhibitors of [33P] 2MeS-ADP binding to cloned human P2Y1 receptors (The P2Y1 receptor membranes we...
US Patent US9428504 (2016)
BindingDB Entry DOI: 10.7270/Q24748SD