BDBM246306 US9434692, 66
SMILES: Cn1nc(cc1-c1ccco1)C(=O)N1CCN(CC(=O)c2ccc(F)cc2)CC1
InChI Key: InChIKey=RXLMQYCTADGJGT-UHFFFAOYSA-N
Data: 1 IC50
Activity Spreadsheet -- Enzyme Inhibition Constant Data from BindingDB
Found 1 hit for monomerid = 246306
Trg + Lig
Ki
nM
ΔG°
kcal/mole
IC50
nM
Kd
nM
EC50/IC50
nM
koff
s-1
kon
M-1s-1
pHTemp
°C
5-hydroxytryptamine receptor 2A
(Homo sapiens (Human))
BDBM246306
(US9434692, 66)
Show SMILES Cn1nc(cc1-c1ccco1)C(=O)N1CCN(CC(=O)c2ccc(F)cc2)CC1
Show InChI InChI=1S/C21H21FN4O3/c1-24-18(20-3-2-12-29-20)13-17(23-24)21(28)26-10-8-25(9-11-26)14-19(27)15-4-6-16(22)7-5-15/h2-7,12-13H,8-11,14H2,1H3
Reactome pathway
US Patent
n/an/a 4.80n/an/an/an/a7.425
Arena Pharmaceuticals, Inc.
US Patent
Assay Description
Radioligand binding assays for human 5-HT2A serotonin receptor was conducted using the 5-HT2 agonist [125I]DOI as radioligand. To define nonspecific ...
US Patent US9434692 (2016)
BindingDB Entry DOI: 10.7270/Q2FJ2FQQ