BDBM24642 4-N-cyclohexane-3-N-(4-fluorophenyl)-1H-pyrazole-3,4-diamido::pyrazole diamide, 21
SMILES: Fc1ccc(NC(=O)c2[nH]ncc2NC(=O)C2CCCCC2)cc1
InChI Key: InChIKey=WYHMIZJZCQZTDC-UHFFFAOYSA-N
Data: 1 IC50
Activity Spreadsheet -- Enzyme Inhibition Constant Data from BindingDB
Found 1 hit for monomerid = 24642
Trg + Lig
Ki
nM
ΔG°
kcal/mole
IC50
nM
Kd
nM
EC50/IC50
nM
koff
s-1
kon
M-1s-1
pHTemp
°C
Cyclin-Dependent Kinase 2 (CDK2)
(Homo sapiens (Human))
BDBM24642
(4-N-cyclohexane-3-N-(4-fluorophenyl)-1H-pyrazole-3...)
Show SMILES Fc1ccc(NC(=O)c2[nH]ncc2NC(=O)C2CCCCC2)cc1
Show InChI InChI=1S/C17H19FN4O2/c18-12-6-8-13(9-7-12)20-17(24)15-14(10-19-22-15)21-16(23)11-4-2-1-3-5-11/h6-11H,1-5H2,(H,19,22)(H,20,24)(H,21,23)
NCI pathway
Reactome pathway
n/an/a 90n/an/an/an/a7.222
Astex
Assay Description
CDK2/cyclin A activity was determined using a radiometric assay to measure the incorporation of gamma-phosphate from [gamma-33P]-ATP into histone H1....
J Med Chem 51: 4986-99 (2008)
Article DOI: 10.1021/jm800382h
BindingDB Entry DOI: 10.7270/Q24X563W
3D
3D Structure (docked)