null
SMILES: COc1cc(OC)c2c(ccc3cc(OC)c(O)cc23)c1
InChI Key: InChIKey=KGYHMWVRKYFQQR-UHFFFAOYSA-N
Activity Spreadsheet -- Enzyme Inhibition Constant Data from BindingDB
Found 1 hit for monomerid = 246494
Trg + Lig
Ki
nM
ΔG°
kcal/mole
IC50
nM
Kd
nM
EC50/IC50
nM
koff
s-1
kon
M-1s-1
pHTemp
°C
Pancreatic triacylglycerol lipase
(Sus scrofa (Pig))
BDBM246494
(Batatasin I (12))
Show SMILES COc1cc(OC)c2c(ccc3cc(OC)c(O)cc23)c1
Show InChI InChI=1S/C17H16O4/c1-19-12-6-11-5-4-10-7-15(20-2)14(18)9-13(10)17(11)16(8-12)21-3/h4-9,18H,1-3H3
n/an/a>5.00E+4n/an/an/an/a7.437
Seoul National University
Assay Description
Various concentrations of test compound (5, 10, 25, 50 and 100 mM) were dissolved in DMSO (final culture concentration 0.1%) and 4-MU oleate and lipa...
J Enzyme Inhib Med Chem 29: 1-6 (2014)
Article DOI: 10.3109/14756366.2012.742517
BindingDB Entry DOI: 10.7270/Q2DJ5DKB