null
SMILES: Oc1cc(O)c2OCCc3ccccc3-c2c1
InChI Key: InChIKey=LNQRHIWAKXZXFC-UHFFFAOYSA-N
Activity Spreadsheet -- Enzyme Inhibition Constant Data from BindingDB
Found 1 hit for monomerid = 246497
Trg + Lig
Ki
nM
ΔG°
kcal/mole
IC50
nM
Kd
nM
EC50/IC50
nM
koff
s-1
kon
M-1s-1
pHTemp
°C
Pancreatic triacylglycerol lipase
(Sus scrofa (Pig))
BDBM246497
(9,10-Dihydro-dibenzoxepin-2,4-diol (15))
Show SMILES Oc1cc(O)c2OCCc3ccccc3-c2c1
Show InChI InChI=1S/C14H12O3/c15-10-7-12-11-4-2-1-3-9(11)5-6-17-14(12)13(16)8-10/h1-4,7-8,15-16H,5-6H2
n/an/a>5.00E+4n/an/an/an/a7.437
Seoul National University
Assay Description
Various concentrations of test compound (5, 10, 25, 50 and 100 mM) were dissolved in DMSO (final culture concentration 0.1%) and 4-MU oleate and lipa...
J Enzyme Inhib Med Chem 29: 1-6 (2014)
Article DOI: 10.3109/14756366.2012.742517
BindingDB Entry DOI: 10.7270/Q2DJ5DKB