BDBM246507 1-(4-Fluorophenyl)-3-(4-(1,3,7,7-tetramethyl-5-oxo-1,2,3,4,5,6,7,8-octahydroquinazolin-4-yl)phenyl)urea (4c)
SMILES: CN1C(C2=C(CC(C)(C)CC2=O)N(C)C1=O)c1ccc(NC(=O)Nc2ccc(F)cc2)cc1
InChI Key: InChIKey=OGXOSYNTLHXABC-UHFFFAOYSA-N
Data: 2 IC50
Activity Spreadsheet -- Enzyme Inhibition Constant Data from BindingDB
Found 2 hits for monomerid = 246507
Trg + Lig
Ki
nM
ΔG°
kcal/mole
IC50
nM
Kd
nM
EC50/IC50
nM
koff
s-1
kon
M-1s-1
pHTemp
°C
Carbonic anhydrase 2
(Homo sapiens (Human))
BDBM246507
(1-(4-Fluorophenyl)-3-(4-(1,3,7,7-tetramethyl-5-oxo...)
Show SMILES CN1C(C2=C(CC(C)(C)CC2=O)N(C)C1=O)c1ccc(NC(=O)Nc2ccc(F)cc2)cc1 |t:3|
Show InChI InChI=1S/C25H27FN4O3/c1-25(2)13-19-21(20(31)14-25)22(30(4)24(33)29(19)3)15-5-9-17(10-6-15)27-23(32)28-18-11-7-16(26)8-12-18/h5-12,22H,13-14H2,1-4H3,(H2,27,28,32)
Reactome pathway
n/an/a 1.42E+5n/an/an/an/an/an/a
Sakarya University
Assay Description
For the inhibition studies of sulphanilamide, different concentrationsof these compounds were added to the enzyme. Activity percentage values of CA f...
J Enzyme Inhib Med Chem 29: 18-22 (2014)
Article DOI: 10.3109/14756366.2012.746972
BindingDB Entry DOI: 10.7270/Q28S4NVM
Carbonic anhydrase 1
(Homo sapiens (Human))
BDBM246507
(1-(4-Fluorophenyl)-3-(4-(1,3,7,7-tetramethyl-5-oxo...)
Show SMILES CN1C(C2=C(CC(C)(C)CC2=O)N(C)C1=O)c1ccc(NC(=O)Nc2ccc(F)cc2)cc1 |t:3|
Show InChI InChI=1S/C25H27FN4O3/c1-25(2)13-19-21(20(31)14-25)22(30(4)24(33)29(19)3)15-5-9-17(10-6-15)27-23(32)28-18-11-7-16(26)8-12-18/h5-12,22H,13-14H2,1-4H3,(H2,27,28,32)
NCI pathway
Reactome pathway
n/an/a 6.62E+4n/an/an/an/an/an/a
Sakarya University
Assay Description
For the inhibition studies of sulphanilamide, different concentrationsof these compounds were added to the enzyme. Activity percentage values of CA f...
J Enzyme Inhib Med Chem 29: 18-22 (2014)
Article DOI: 10.3109/14756366.2012.746972
BindingDB Entry DOI: 10.7270/Q28S4NVM