BDBM24653 4-N-(2-chloro-6-fluorobenzene)-3-N-(piperidin-4-yl)-1H-pyrazole-3,4-diamido::pyrazole diamide, 32
SMILES: Fc1cccc(Cl)c1C(=O)Nc1cn[nH]c1C(=O)NC1CCNCC1
InChI Key: InChIKey=HPCOUXPDYAOAFD-UHFFFAOYSA-N
Data: 1 IC50
Activity Spreadsheet -- Enzyme Inhibition Constant Data from BindingDB
Found 1 hit for monomerid = 24653
Trg + Lig
Ki
nM
ΔG°
kcal/mole
IC50
nM
Kd
nM
EC50/IC50
nM
koff
s-1
kon
M-1s-1
pHTemp
°C
Cyclin-Dependent Kinase 2 (CDK2)
(Homo sapiens (Human))
BDBM24653
(4-N-(2-chloro-6-fluorobenzene)-3-N-(piperidin-4-yl...)
Show SMILES Fc1cccc(Cl)c1C(=O)Nc1cn[nH]c1C(=O)NC1CCNCC1
Show InChI InChI=1S/C16H17ClFN5O2/c17-10-2-1-3-11(18)13(10)15(24)22-12-8-20-23-14(12)16(25)21-9-4-6-19-7-5-9/h1-3,8-9,19H,4-7H2,(H,20,23)(H,21,25)(H,22,24)
NCI pathway
Reactome pathway
n/an/a 110n/an/an/an/a7.222
Astex
Assay Description
CDK2/cyclin A activity was determined using a radiometric assay to measure the incorporation of gamma-phosphate from [gamma-33P]-ATP into histone H1....
J Med Chem 51: 4986-99 (2008)
Article DOI: 10.1021/jm800382h
BindingDB Entry DOI: 10.7270/Q24X563W
3D
3D Structure (docked)