BDBM24655 1-benzyl-5-phenyl-1H-imidazole::4-phenylimidazole (4-PI) derivative, 27
SMILES: C(c1ccccc1)n1cncc1-c1ccccc1
InChI Key: InChIKey=AWZYHJQWJWUOHS-UHFFFAOYSA-N
Data: 3 IC50
Activity Spreadsheet -- Enzyme Inhibition Constant Data from BindingDB
Found 3 hits for monomerid = 24655
Trg + Lig
Ki
nM
ΔG°
kcal/mole
IC50
nM
Kd
nM
EC50/IC50
nM
koff
s-1
kon
M-1s-1
pHTemp
°C
Indoleamine 2,3-dioxygenase
(Homo sapiens (Human))
BDBM24655
(1-benzyl-5-phenyl-1H-imidazole | 4-phenylimidazole...)
Show SMILES C(c1ccccc1)n1cncc1-c1ccccc1
Show InChI InChI=1S/C16H14N2/c1-3-7-14(8-4-1)12-18-13-17-11-16(18)15-9-5-2-6-10-15/h1-11,13H,12H2
Reactome pathway
n/an/a 3.20E+4n/an/an/an/a6.537
Bryn Mawr College
Assay Description
The IC50 inhibition assays were performed in a 96-well microtiter plate format using purified recombinant IDO, which was added to the substrate, L-tr...
J Med Chem 51: 4968-77 (2008)
Article DOI: 10.1021/jm800512z
BindingDB Entry DOI: 10.7270/Q2154FB1
Cytochrome P450 11B2 (CYP11B2)
(Homo sapiens (Human))
BDBM24655
(1-benzyl-5-phenyl-1H-imidazole | 4-phenylimidazole...)
Show SMILES C(c1ccccc1)n1cncc1-c1ccccc1
Show InChI InChI=1S/C16H14N2/c1-3-7-14(8-4-1)12-18-13-17-11-16(18)15-9-5-2-6-10-15/h1-11,13H,12H2
n/an/a 11n/an/an/an/an/an/a
Eindhoven University of Technology
Curated by ChEMBL
Assay Description
Inhibition of human CYP11B2 expressed in chinese hamster V79 cells
J Med Chem 53: 1712-25 (2010)
Article DOI: 10.1021/jm901356d
BindingDB Entry DOI: 10.7270/Q2XS5VGF
Cytochrome P450 11B1, mitochondrial
(Homo sapiens (Human))
BDBM24655
(1-benzyl-5-phenyl-1H-imidazole | 4-phenylimidazole...)
Show SMILES C(c1ccccc1)n1cncc1-c1ccccc1
Show InChI InChI=1S/C16H14N2/c1-3-7-14(8-4-1)12-18-13-17-11-16(18)15-9-5-2-6-10-15/h1-11,13H,12H2
n/an/a 4.80n/an/an/an/an/an/a
Eindhoven University of Technology
Curated by ChEMBL
Assay Description
Inhibition of human CYP11B1 expressed in chinese hamster V79 cells
J Med Chem 53: 1712-25 (2010)
Article DOI: 10.1021/jm901356d
BindingDB Entry DOI: 10.7270/Q2XS5VGF