null
SMILES: Fc1cccc(c1)-c1c[nH]cn1
InChI Key: InChIKey=JCZROCCJDLYESM-UHFFFAOYSA-N
Activity Spreadsheet -- Enzyme Inhibition Constant Data from BindingDB
Found 1 hit for monomerid = 24683
Trg + Lig
Ki
nM
ΔG°
kcal/mole
IC50
nM
Kd
nM
EC50/IC50
nM
koff
s-1
kon
M-1s-1
pHTemp
°C
Indoleamine 2,3-dioxygenase 1
(Homo sapiens (Human))
BDBM24683
(4-(3-fluorophenyl)-1H-imidazole | 4-(3-fluoropheny...)
Show SMILES Fc1cccc(c1)-c1c[nH]cn1
Show InChI InChI=1S/C9H7FN2/c10-8-3-1-2-7(4-8)9-5-11-6-12-9/h1-6H,(H,11,12)
Reactome pathway
n/an/a 6.00E+4n/an/an/an/a6.537
Bryn Mawr College
Assay Description
The IC50 inhibition assays were performed in a 96-well microtiter plate format using purified recombinant IDO, which was added to the substrate, L-tr...
J Med Chem 51: 4968-77 (2008)
Article DOI: 10.1021/jm800512z
BindingDB Entry DOI: 10.7270/Q2154FB1
3D
3D Structure (docked)