BDBM24696 4-aminopyrazolylpyrimidine analogue, 10b::5-bromo-4-N-(5-cyclopropyl-1H-pyrazol-3-yl)-2-N-[(3-methoxyphenyl)methyl]pyrimidine-2,4-diamine
SMILES: COc1cccc(CNc2ncc(Br)c(Nc3cc(n[nH]3)C3CC3)n2)c1
InChI Key: InChIKey=XSRNXUBVNYNCJC-UHFFFAOYSA-N
Data: 1 IC50
Activity Spreadsheet -- Enzyme Inhibition Constant Data from BindingDB
Found 1 hit for monomerid = 24696
Trg + Lig
Ki
nM
ΔG°
kcal/mole
IC50
nM
Kd
nM
EC50/IC50
nM
koff
s-1
kon
M-1s-1
pHTemp
°C
High affinity nerve growth factor receptor
(Homo sapiens (Human))
BDBM24696
(4-aminopyrazolylpyrimidine analogue, 10b | 5-bromo...)
Show SMILES COc1cccc(CNc2ncc(Br)c(Nc3cc(n[nH]3)C3CC3)n2)c1
Show InChI InChI=1S/C18H19BrN6O/c1-26-13-4-2-3-11(7-13)9-20-18-21-10-14(19)17(23-18)22-16-8-15(24-25-16)12-5-6-12/h2-4,7-8,10,12H,5-6,9H2,1H3,(H3,20,21,22,23,24,25)
n/an/a 720n/an/an/an/a7.422
AstraZeneca
Assay Description
TrkA kinase activity was determined by measuring the kinase ability to phosphorylate synthetic tyrosine residues within a generic polypeptide substra...
J Med Chem 51: 4672-84 (2008)
Article DOI: 10.1021/jm800343j
BindingDB Entry DOI: 10.7270/Q2RN365V