null
SMILES: C[C@H]1OC(=O)[C@@]2(CC(F)(F)[C@@H](C)[C@H](\C=C\c3ccc(cn3)-c3cccc(C)c3F)[C@H]12)C(N)=O
InChI Key: InChIKey=SIEHSRBCJWSMER-ZNIVZFFCSA-N
Activity Spreadsheet -- Enzyme Inhibition Constant Data from BindingDB
Found 2 hits for monomerid = 247035
Trg + Lig
Ki
nM
ΔG°
kcal/mole
IC50
nM
Kd
nM
EC50/IC50
nM
koff
s-1
kon
M-1s-1
pHTemp
°C
Serine/threonine-protein kinase MARK2
(Homo sapiens (Human))
BDBM247035
((1R,3aR,6S,7R, 7aS)-5,5-difluoro- 7-((E)-2-(5- (2-...)
Show SMILES C[C@H]1OC(=O)[C@@]2(CC(F)(F)[C@@H](C)[C@H](\C=C\c3ccc(cn3)-c3cccc(C)c3F)[C@H]12)C(N)=O |r|
Show InChI InChI=1S/C25H25F3N2O3/c1-13-5-4-6-19(21(13)26)16-7-8-17(30-11-16)9-10-18-14(2)25(27,28)12-24(22(29)31)20(18)15(3)33-23(24)32/h4-11,14-15,18,20H,12H2,1-3H3,(H2,29,31)/b10-9+/t14-,15+,18-,20-,24+/m0/s1
NCI pathway
US Patent
n/an/a 3.80n/an/an/an/an/an/a
Merck Sharp & Dohme Corp.
US Patent
Assay Description
This assay measures the potency of the inventive compounds as PAR-1 receptor antagonists.Frozen HEK 293 Cells were plated in 384-well PDL coated plat...
US Patent US9701669 (2017)
BindingDB Entry DOI: 10.7270/Q2PC34DS
Potassium voltage-gated channel subfamily H member 2
(Homo sapiens (Human))
BDBM247035
((1R,3aR,6S,7R, 7aS)-5,5-difluoro- 7-((E)-2-(5- (2-...)
Show SMILES C[C@H]1OC(=O)[C@@]2(CC(F)(F)[C@@H](C)[C@H](\C=C\c3ccc(cn3)-c3cccc(C)c3F)[C@H]12)C(N)=O |r|
Show InChI InChI=1S/C25H25F3N2O3/c1-13-5-4-6-19(21(13)26)16-7-8-17(30-11-16)9-10-18-14(2)25(27,28)12-24(22(29)31)20(18)15(3)33-23(24)32/h4-11,14-15,18,20H,12H2,1-3H3,(H2,29,31)/b10-9+/t14-,15+,18-,20-,24+/m0/s1
Reactome pathway
US Patent
n/an/a 1.30E+4n/an/an/an/a7.425
Merck Sharp & Dohme Corp.
US Patent
Assay Description
Drug cardiac arrhythmia is an important safety concern for pharmaceutical development and health regulatory authorities. Blockade of heterologously-e...
US Patent US9701669 (2017)
BindingDB Entry DOI: 10.7270/Q2PC34DS