null
SMILES: OC[C@H](Nc1ncc(Cl)c(Nc2cc(n[nH]2)C2CC2)n1)c1ccc(F)cc1
InChI Key: InChIKey=FXSOVNSBVDXYOV-HNNXBMFYSA-N
Activity Spreadsheet -- Enzyme Inhibition Constant Data from BindingDB
Found 1 hit for monomerid = 24706
Trg + Lig
Ki
nM
ΔG°
kcal/mole
IC50
nM
Kd
nM
EC50/IC50
nM
koff
s-1
kon
M-1s-1
pHTemp
°C
High affinity nerve growth factor receptor
(Homo sapiens (Human))
BDBM24706
((2R)-2-({5-chloro-4-[(5-cyclopropyl-1H-pyrazol-3-y...)
Show SMILES OC[C@H](Nc1ncc(Cl)c(Nc2cc(n[nH]2)C2CC2)n1)c1ccc(F)cc1 |r|
Show InChI InChI=1S/C18H18ClFN6O/c19-13-8-21-18(22-15(9-27)11-3-5-12(20)6-4-11)24-17(13)23-16-7-14(25-26-16)10-1-2-10/h3-8,10,15,27H,1-2,9H2,(H3,21,22,23,24,25,26)/t15-/m0/s1
n/an/a 10n/an/an/an/a7.422
AstraZeneca
Assay Description
TrkA kinase activity was determined by measuring the kinase ability to phosphorylate synthetic tyrosine residues within a generic polypeptide substra...
J Med Chem 51: 4672-84 (2008)
Article DOI: 10.1021/jm800343j
BindingDB Entry DOI: 10.7270/Q2RN365V