BDBM247070 3-((6-((4-(3-(3-isopropyl-1-(4-methoxyphenyl)-1H-pyrazol-5-yl)ureido) naphthalen-1-yl)oxy)pyrimidin-4-yl)amino)-5-methoxy-N-(2-morpholinoethyl)benzamide::US9701670, 14
SMILES: COc1ccc(cc1)-n1nc(cc1NC(=O)Nc1ccc(Oc2cc(Nc3cc(OC)cc(c3)C(=O)NCCN3CCOCC3)ncn2)c2ccccc12)C(C)(C)C
InChI Key: InChIKey=DDKIKSYBXRUQAD-UHFFFAOYSA-N
Data: 4 IC50
Activity Spreadsheet -- Enzyme Inhibition Constant Data from BindingDB
Found 4 hits for monomerid = 247070
Trg + Lig
Ki
nM
ΔG°
kcal/mole
IC50
nM
Kd
nM
EC50/IC50
nM
koff
s-1
kon
M-1s-1
pHTemp
°C
Mitogen-activated protein kinase 14
(Homo sapiens (Human))
BDBM247070
(3-((6-((4-(3-(3-isopropyl-1-(4-methoxyphenyl)-1H-p...)
Show SMILES COc1ccc(cc1)-n1nc(cc1NC(=O)Nc1ccc(Oc2cc(Nc3cc(OC)cc(c3)C(=O)NCCN3CCOCC3)ncn2)c2ccccc12)C(C)(C)C
Show InChI InChI=1S/C43H47N9O6/c1-43(2,3)37-25-39(52(50-37)30-10-12-31(55-4)13-11-30)49-42(54)48-35-14-15-36(34-9-7-6-8-33(34)35)58-40-26-38(45-27-46-40)47-29-22-28(23-32(24-29)56-5)41(53)44-16-17-51-18-20-57-21-19-51/h6-15,22-27H,16-21H2,1-5H3,(H,44,53)(H,45,46,47)(H2,48,49,54)
NCI pathway
Reactome pathway
US Patent
n/an/a<1n/an/an/an/an/an/a
RESPIVERT LIMITED; TOPIVERT PHARMA LIMITED
US Patent
Assay Description
The inhibitory activities of test compounds against the p38 MAPKα isoform (MAPK14: Invitrogen), are evaluated indirectly by determining the leve...
US Patent US9701670 (2017)
BindingDB Entry DOI: 10.7270/Q2JM2CP2
Glycogen synthase kinase-3
(Homo sapiens (Human))
BDBM247070
(3-((6-((4-(3-(3-isopropyl-1-(4-methoxyphenyl)-1H-p...)
Show SMILES COc1ccc(cc1)-n1nc(cc1NC(=O)Nc1ccc(Oc2cc(Nc3cc(OC)cc(c3)C(=O)NCCN3CCOCC3)ncn2)c2ccccc12)C(C)(C)C
Show InChI InChI=1S/C43H47N9O6/c1-43(2,3)37-25-39(52(50-37)30-10-12-31(55-4)13-11-30)49-42(54)48-35-14-15-36(34-9-7-6-8-33(34)35)58-40-26-38(45-27-46-40)47-29-22-28(23-32(24-29)56-5)41(53)44-16-17-51-18-20-57-21-19-51/h6-15,22-27H,16-21H2,1-5H3,(H,44,53)(H,45,46,47)(H2,48,49,54)
NCI pathway
Reactome pathway
US Patent
n/an/a 355n/an/an/an/an/an/a
RESPIVERT LIMITED; TOPIVERT PHARMA LIMITED
US Patent
Assay Description
The inhibitory activities of compounds of the invention against the GSK 3α enzyme isoform (Invitrogen), are evaluated by determining the level o...
US Patent US9701670 (2017)
BindingDB Entry DOI: 10.7270/Q2JM2CP2
Tyrosine-protein kinase SYK
(Homo sapiens (Human))
BDBM247070
(3-((6-((4-(3-(3-isopropyl-1-(4-methoxyphenyl)-1H-p...)
Show SMILES COc1ccc(cc1)-n1nc(cc1NC(=O)Nc1ccc(Oc2cc(Nc3cc(OC)cc(c3)C(=O)NCCN3CCOCC3)ncn2)c2ccccc12)C(C)(C)C
Show InChI InChI=1S/C43H47N9O6/c1-43(2,3)37-25-39(52(50-37)30-10-12-31(55-4)13-11-30)49-42(54)48-35-14-15-36(34-9-7-6-8-33(34)35)58-40-26-38(45-27-46-40)47-29-22-28(23-32(24-29)56-5)41(53)44-16-17-51-18-20-57-21-19-51/h6-15,22-27H,16-21H2,1-5H3,(H,44,53)(H,45,46,47)(H2,48,49,54)
NCI pathway
Reactome pathway
US Patent
n/an/a>1.30E+3n/an/an/an/an/an/a
RESPIVERT LIMITED; TOPIVERT PHARMA LIMITED
US Patent
Assay Description
The inhibitory activities of compounds of the invention against Syk enzymes (Invitrogen), are evaluated in a similar fashion to that described herein...
US Patent US9701670 (2017)
BindingDB Entry DOI: 10.7270/Q2JM2CP2
Proto-oncogene tyrosine-protein kinase Src
(Homo sapiens (Human))
BDBM247070
(3-((6-((4-(3-(3-isopropyl-1-(4-methoxyphenyl)-1H-p...)
Show SMILES COc1ccc(cc1)-n1nc(cc1NC(=O)Nc1ccc(Oc2cc(Nc3cc(OC)cc(c3)C(=O)NCCN3CCOCC3)ncn2)c2ccccc12)C(C)(C)C
Show InChI InChI=1S/C43H47N9O6/c1-43(2,3)37-25-39(52(50-37)30-10-12-31(55-4)13-11-30)49-42(54)48-35-14-15-36(34-9-7-6-8-33(34)35)58-40-26-38(45-27-46-40)47-29-22-28(23-32(24-29)56-5)41(53)44-16-17-51-18-20-57-21-19-51/h6-15,22-27H,16-21H2,1-5H3,(H,44,53)(H,45,46,47)(H2,48,49,54)
US Patent
n/an/a 4n/an/an/an/an/an/a
RESPIVERT LIMITED; TOPIVERT PHARMA LIMITED
US Patent
Assay Description
The inhibitory activities of compounds of the invention against c-Src and Syk enzymes (Invitrogen), are evaluated in a similar fashion to that descri...
US Patent US9701670 (2017)
BindingDB Entry DOI: 10.7270/Q2JM2CP2