BDBM24711 7,7-dimethyl-2-(5-methyl-1H-pyrazol-3-yl)-1H,5H,6H,7H-imidazo[4,5-f]indol-6-one::Lactam analogue, 1
SMILES: Cc1cc(n[nH]1)-c1nc2cc3c(NC(=O)C3(C)C)cc2[nH]1
InChI Key: InChIKey=DRKOUHSEDVEHEG-UHFFFAOYSA-N
Data: 2 IC50
Activity Spreadsheet -- Enzyme Inhibition Constant Data from BindingDB
Found 2 hits for monomerid = 24711
Trg + Lig
Ki
nM
ΔG°
kcal/mole
IC50
nM
Kd
nM
EC50/IC50
nM
koff
s-1
kon
M-1s-1
pHTemp
°C
Aurora kinase B
(Homo sapiens (Human))
BDBM24711
(7,7-dimethyl-2-(5-methyl-1H-pyrazol-3-yl)-1H,5H,6H...)
Show SMILES Cc1cc(n[nH]1)-c1nc2cc3c(NC(=O)C3(C)C)cc2[nH]1
Show InChI InChI=1S/C15H15N5O/c1-7-4-12(20-19-7)13-16-10-5-8-9(6-11(10)17-13)18-14(21)15(8,2)3/h4-6H,1-3H3,(H,16,17)(H,18,21)(H,19,20)
Reactome pathway
n/an/a 150n/an/an/an/a7.522
Genentech
Assay Description
Aurora kinase was assayed in ELISA format using a GST fusion of the N-terminus of Histone H3 as substrate. Plates were coated with substrate, and the...
J Med Chem 51: 4465-75 (2008)
Article DOI: 10.1021/jm800052b
BindingDB Entry DOI: 10.7270/Q2H70D4F
Aurora kinase A
(Homo sapiens (Human))
BDBM24711
(7,7-dimethyl-2-(5-methyl-1H-pyrazol-3-yl)-1H,5H,6H...)
Show SMILES Cc1cc(n[nH]1)-c1nc2cc3c(NC(=O)C3(C)C)cc2[nH]1
Show InChI InChI=1S/C15H15N5O/c1-7-4-12(20-19-7)13-16-10-5-8-9(6-11(10)17-13)18-14(21)15(8,2)3/h4-6H,1-3H3,(H,16,17)(H,18,21)(H,19,20)
NCI pathway
Reactome pathway
n/an/a 180n/an/an/an/a7.522
Genentech
Assay Description
Aurora kinase was assayed in ELISA format using a GST fusion of the N-terminus of Histone H3 as substrate. Plates were coated with substrate, and the...
J Med Chem 51: 4465-75 (2008)
Article DOI: 10.1021/jm800052b
BindingDB Entry DOI: 10.7270/Q2H70D4F