BDBM24718 2-(5-Methyl-1H-pyrazol-3-yl)-1H-indole::pyrazole-indole, 20
SMILES: Cc1cc(n[nH]1)-c1cc2ccccc2[nH]1
InChI Key: InChIKey=YLKJJERCKRGNPB-UHFFFAOYSA-N
Data: 2 IC50
Activity Spreadsheet -- Enzyme Inhibition Constant Data from BindingDB
Found 2 hits for monomerid = 24718
Trg + Lig
Ki
nM
ΔG°
kcal/mole
IC50
nM
Kd
nM
EC50/IC50
nM
koff
s-1
kon
M-1s-1
pHTemp
°C
Aurora kinase B
(Homo sapiens (Human))
BDBM24718
(2-(5-Methyl-1H-pyrazol-3-yl)-1H-indole | pyrazole-...)
Show SMILES Cc1cc(n[nH]1)-c1cc2ccccc2[nH]1
Show InChI InChI=1S/C12H11N3/c1-8-6-12(15-14-8)11-7-9-4-2-3-5-10(9)13-11/h2-7,13H,1H3,(H,14,15)
Reactome pathway
n/an/a 510n/an/an/an/a7.522
Genentech
Assay Description
Aurora kinase was assayed in ELISA format using a GST fusion of the N-terminus of Histone H3 as substrate. Plates were coated with substrate, and the...
J Med Chem 51: 4465-75 (2008)
Article DOI: 10.1021/jm800052b
BindingDB Entry DOI: 10.7270/Q2H70D4F
Aurora kinase A
(Homo sapiens (Human))
BDBM24718
(2-(5-Methyl-1H-pyrazol-3-yl)-1H-indole | pyrazole-...)
Show SMILES Cc1cc(n[nH]1)-c1cc2ccccc2[nH]1
Show InChI InChI=1S/C12H11N3/c1-8-6-12(15-14-8)11-7-9-4-2-3-5-10(9)13-11/h2-7,13H,1H3,(H,14,15)
NCI pathway
Reactome pathway
n/an/a 1.10E+3n/an/an/an/a7.522
Genentech
Assay Description
Aurora kinase was assayed in ELISA format using a GST fusion of the N-terminus of Histone H3 as substrate. Plates were coated with substrate, and the...
J Med Chem 51: 4465-75 (2008)
Article DOI: 10.1021/jm800052b
BindingDB Entry DOI: 10.7270/Q2H70D4F