BDBM24753 2-benzyl-5-[3-fluoro-4-({6-methoxy-7-[3-(1H-1,2,4-triazol-1-yl)propoxy]quinolin-4-yl}oxy)phenyl]-3-methyl-3,4-dihydropyrimidin-4-one::pyrimidone, 24
SMILES: COc1cc2c(Oc3ccc(cc3F)-c3cnc(Cc4ccccc4)n(C)c3=O)ccnc2cc1OCCCn1cncn1
InChI Key: InChIKey=TXXALIOZTNGKSD-UHFFFAOYSA-N
Data: 1 KI  1 IC50
Activity Spreadsheet -- Enzyme Inhibition Constant Data from BindingDB
Found 2 hits for monomerid = 24753
Trg + Lig
Ki
nM
ΔG°
kcal/mole
IC50
nM
Kd
nM
EC50/IC50
nM
koff
s-1
kon
M-1s-1
pHTemp
°C
Hepatocyte growth factor receptor
(Homo sapiens (Human))
BDBM24753
(2-benzyl-5-[3-fluoro-4-({6-methoxy-7-[3-(1H-1,2,4-...)
Show SMILES COc1cc2c(Oc3ccc(cc3F)-c3cnc(Cc4ccccc4)n(C)c3=O)ccnc2cc1OCCCn1cncn1
Show InChI InChI=1S/C33H29FN6O4/c1-39-32(15-22-7-4-3-5-8-22)37-19-25(33(39)41)23-9-10-29(26(34)16-23)44-28-11-12-36-27-18-31(30(42-2)17-24(27)28)43-14-6-13-40-21-35-20-38-40/h3-5,7-12,16-21H,6,13-15H2,1-2H3
29 -10.2n/an/an/an/an/a7.522
Amgen
Assay Description
In vitro kinase assays were done to establish IC50 values against recombinant enzymes using homogeneous time-resolved fluorescence (HTRF) assay. For ...
J Med Chem 51: 5766-79 (2008)
Article DOI: 10.1021/jm8006189
BindingDB Entry DOI: 10.7270/Q23X84XN
Hepatocyte growth factor receptor
(Homo sapiens (Human))
BDBM24753
(2-benzyl-5-[3-fluoro-4-({6-methoxy-7-[3-(1H-1,2,4-...)
Show SMILES COc1cc2c(Oc3ccc(cc3F)-c3cnc(Cc4ccccc4)n(C)c3=O)ccnc2cc1OCCCn1cncn1
Show InChI InChI=1S/C33H29FN6O4/c1-39-32(15-22-7-4-3-5-8-22)37-19-25(33(39)41)23-9-10-29(26(34)16-23)44-28-11-12-36-27-18-31(30(42-2)17-24(27)28)43-14-6-13-40-21-35-20-38-40/h3-5,7-12,16-21H,6,13-15H2,1-2H3
n/an/a 29n/an/an/an/an/an/a
Sichuan University
Curated by ChEMBL
Assay Description
Inhibition of human c-MET
Eur J Med Chem 46: 3675-80 (2011)
Article DOI: 10.1016/j.ejmech.2011.05.031
BindingDB Entry DOI: 10.7270/Q2891676