BDBM24757 2-benzyl-5-{4-[(6,7-dimethoxyquinolin-4-yl)oxy]-3-fluorophenyl}-3,4-dihydropyrimidin-4-one::pyrimidone, 34
SMILES: COc1cc2nccc(Oc3ccc(cc3F)-c3cnc(Cc4ccccc4)[nH]c3=O)c2cc1OC
InChI Key: InChIKey=VFNQFMVWZBQRKK-UHFFFAOYSA-N
Data: 1 KI  1 IC50
PDB links: 2 PDB IDs contain this monomer as substructures. 2 PDB IDs contain inhibitors having a similarity of 90% to this monomer.
Activity Spreadsheet -- Enzyme Inhibition Constant Data from BindingDB
Found 2 hits for monomerid = 24757
Trg + Lig
Ki
nM
ΔG°
kcal/mole
IC50
nM
Kd
nM
EC50/IC50
nM
koff
s-1
kon
M-1s-1
pHTemp
°C
Hepatocyte growth factor receptor
(Homo sapiens (Human))
BDBM24757
(2-benzyl-5-{4-[(6,7-dimethoxyquinolin-4-yl)oxy]-3-...)
Show SMILES COc1cc2nccc(Oc3ccc(cc3F)-c3cnc(Cc4ccccc4)[nH]c3=O)c2cc1OC
Show InChI InChI=1S/C28H22FN3O4/c1-34-25-14-19-22(15-26(25)35-2)30-11-10-23(19)36-24-9-8-18(13-21(24)29)20-16-31-27(32-28(20)33)12-17-6-4-3-5-7-17/h3-11,13-16H,12H2,1-2H3,(H,31,32,33)
107 -9.41n/an/an/an/an/a7.522
Amgen
Assay Description
In vitro kinase assays were done to establish IC50 values against recombinant enzymes using homogeneous time-resolved fluorescence (HTRF) assay. For ...
J Med Chem 51: 5766-79 (2008)
Article DOI: 10.1021/jm8006189
BindingDB Entry DOI: 10.7270/Q23X84XN
Hepatocyte growth factor receptor
(Homo sapiens (Human))
BDBM24757
(2-benzyl-5-{4-[(6,7-dimethoxyquinolin-4-yl)oxy]-3-...)
Show SMILES COc1cc2nccc(Oc3ccc(cc3F)-c3cnc(Cc4ccccc4)[nH]c3=O)c2cc1OC
Show InChI InChI=1S/C28H22FN3O4/c1-34-25-14-19-22(15-26(25)35-2)30-11-10-23(19)36-24-9-8-18(13-21(24)29)20-16-31-27(32-28(20)33)12-17-6-4-3-5-7-17/h3-11,13-16H,12H2,1-2H3,(H,31,32,33)
n/an/a 107n/an/an/an/an/an/a
Sichuan University
Curated by ChEMBL
Assay Description
Inhibition of human c-MET
Eur J Med Chem 46: 3675-80 (2011)
Article DOI: 10.1016/j.ejmech.2011.05.031
BindingDB Entry DOI: 10.7270/Q2891676