BDBM24771 5-{4-[(6,7-dimethoxyquinolin-4-yl)oxy]-3-fluorophenyl}-3-methyl-2-{[4-(trifluoromethyl)phenyl]amino}-3,4-dihydropyrimidin-4-one::pyrimidone, 56
SMILES: COc1cc2nccc(Oc3ccc(cc3F)-c3cnc(Nc4ccc(cc4)C(F)(F)F)n(C)c3=O)c2cc1OC
InChI Key: InChIKey=WKDSRSWTJRXFHC-UHFFFAOYSA-N
Data: 1 KI  1 IC50
Activity Spreadsheet -- Enzyme Inhibition Constant Data from BindingDB
Found 2 hits for monomerid = 24771
Trg + Lig
Ki
nM
ΔG°
kcal/mole
IC50
nM
Kd
nM
EC50/IC50
nM
koff
s-1
kon
M-1s-1
pHTemp
°C
Hepatocyte growth factor receptor
(Homo sapiens (Human))
BDBM24771
(5-{4-[(6,7-dimethoxyquinolin-4-yl)oxy]-3-fluorophe...)
Show SMILES COc1cc2nccc(Oc3ccc(cc3F)-c3cnc(Nc4ccc(cc4)C(F)(F)F)n(C)c3=O)c2cc1OC
Show InChI InChI=1S/C29H22F4N4O4/c1-37-27(38)20(15-35-28(37)36-18-7-5-17(6-8-18)29(31,32)33)16-4-9-24(21(30)12-16)41-23-10-11-34-22-14-26(40-3)25(39-2)13-19(22)23/h4-15H,1-3H3,(H,35,36)
136 -9.27n/an/an/an/an/a7.522
Amgen
Assay Description
In vitro kinase assays were done to establish IC50 values against recombinant enzymes using homogeneous time-resolved fluorescence (HTRF) assay. For ...
J Med Chem 51: 5766-79 (2008)
Article DOI: 10.1021/jm8006189
BindingDB Entry DOI: 10.7270/Q23X84XN
Hepatocyte growth factor receptor
(Homo sapiens (Human))
BDBM24771
(5-{4-[(6,7-dimethoxyquinolin-4-yl)oxy]-3-fluorophe...)
Show SMILES COc1cc2nccc(Oc3ccc(cc3F)-c3cnc(Nc4ccc(cc4)C(F)(F)F)n(C)c3=O)c2cc1OC
Show InChI InChI=1S/C29H22F4N4O4/c1-37-27(38)20(15-35-28(37)36-18-7-5-17(6-8-18)29(31,32)33)16-4-9-24(21(30)12-16)41-23-10-11-34-22-14-26(40-3)25(39-2)13-19(22)23/h4-15H,1-3H3,(H,35,36)
n/an/a 136n/an/an/an/an/an/a
Sichuan University
Curated by ChEMBL
Assay Description
Inhibition of human c-MET
Eur J Med Chem 46: 3675-80 (2011)
Article DOI: 10.1016/j.ejmech.2011.05.031
BindingDB Entry DOI: 10.7270/Q2891676