BDBM247960 US9434724, 34
SMILES: COc1ccc2[nH]cc(C(=O)OCC34CCN(CC3)CC4)c2c1C
InChI Key: InChIKey=QQUURDHIAIQVBB-UHFFFAOYSA-N
Data: 1 KI  6 IC50
Activity Spreadsheet -- Enzyme Inhibition Constant Data from BindingDB
Found 6 hits for monomerid = 247960
Trg + Lig
Ki
nM
ΔG°
kcal/mole
IC50
nM
Kd
nM
EC50/IC50
nM
koff
s-1
kon
M-1s-1
pHTemp
°C
Neuronal acetylcholine receptor
(Rattus norvegicus (Rat))
BDBM247960
(US9434724, 34)
Show SMILES COc1ccc2[nH]cc(C(=O)OCC34CCN(CC3)CC4)c2c1C
Show InChI InChI=1S/C19H24N2O3/c1-13-16(23-2)4-3-15-17(13)14(11-20-15)18(22)24-12-19-5-8-21(9-6-19)10-7-19/h3-4,11,20H,5-10,12H2,1-2H3
Reactome pathway
US Patent
20.4 -10.9 23.6n/an/an/an/a7.437
ALPHARMAGEN, LLC
US Patent
Assay Description
Protocol 1: The assay was conducted following the literature reference Meyer E. M., et al., Analysis of 3-(4-Hydroxy, 2-Methoxybenzylidene) Anabasein...
US Patent US9434724 (2016)
BindingDB Entry DOI: 10.7270/Q2M32TPW
Cytochrome P450 2C19
(Homo sapiens (Human))
BDBM247960
(US9434724, 34)
Show SMILES COc1ccc2[nH]cc(C(=O)OCC34CCN(CC3)CC4)c2c1C
Show InChI InChI=1S/C19H24N2O3/c1-13-16(23-2)4-3-15-17(13)14(11-20-15)18(22)24-12-19-5-8-21(9-6-19)10-7-19/h3-4,11,20H,5-10,12H2,1-2H3
Reactome pathway
US Patent
n/an/a>1.00E+4n/an/an/an/an/an/a
ALPHARMAGEN, LLC
US Patent
Assay Description
Protocol 2: Stock solution for NCEs (test articles) and standard inhibitors were prepared at a concentration of 20 mM in DMSO. Stock solutions were d...
US Patent US9434724 (2016)
BindingDB Entry DOI: 10.7270/Q2M32TPW
Cytochrome P450 1A
(Homo sapiens (Human))
BDBM247960
(US9434724, 34)
Show SMILES COc1ccc2[nH]cc(C(=O)OCC34CCN(CC3)CC4)c2c1C
Show InChI InChI=1S/C19H24N2O3/c1-13-16(23-2)4-3-15-17(13)14(11-20-15)18(22)24-12-19-5-8-21(9-6-19)10-7-19/h3-4,11,20H,5-10,12H2,1-2H3
Reactome pathway
US Patent
n/an/a>1.00E+4n/an/an/an/an/an/a
ALPHARMAGEN, LLC
US Patent
Assay Description
Protocol 2: Stock solution for NCEs (test articles) and standard inhibitors were prepared at a concentration of 20 mM in DMSO. Stock solutions were d...
US Patent US9434724 (2016)
BindingDB Entry DOI: 10.7270/Q2M32TPW
Cytochrome P450 2C9
(Homo sapiens (Human))
BDBM247960
(US9434724, 34)
Show SMILES COc1ccc2[nH]cc(C(=O)OCC34CCN(CC3)CC4)c2c1C
Show InChI InChI=1S/C19H24N2O3/c1-13-16(23-2)4-3-15-17(13)14(11-20-15)18(22)24-12-19-5-8-21(9-6-19)10-7-19/h3-4,11,20H,5-10,12H2,1-2H3
Reactome pathway
US Patent
n/an/a>1.00E+4n/an/an/an/an/an/a
ALPHARMAGEN, LLC
US Patent
Assay Description
Protocol 2: Stock solution for NCEs (test articles) and standard inhibitors were prepared at a concentration of 20 mM in DMSO. Stock solutions were d...
US Patent US9434724 (2016)
BindingDB Entry DOI: 10.7270/Q2M32TPW
Cytochrome P450 3A4
(Homo sapiens (Human))
BDBM247960
(US9434724, 34)
Show SMILES COc1ccc2[nH]cc(C(=O)OCC34CCN(CC3)CC4)c2c1C
Show InChI InChI=1S/C19H24N2O3/c1-13-16(23-2)4-3-15-17(13)14(11-20-15)18(22)24-12-19-5-8-21(9-6-19)10-7-19/h3-4,11,20H,5-10,12H2,1-2H3
Reactome pathway
US Patent
n/an/a>1.00E+4n/an/an/an/an/an/a
ALPHARMAGEN, LLC
US Patent
Assay Description
Protocol 2: Stock solution for NCEs (test articles) and standard inhibitors were prepared at a concentration of 20 mM in DMSO. Stock solutions were d...
US Patent US9434724 (2016)
BindingDB Entry DOI: 10.7270/Q2M32TPW
Cytochrome P450 2D6
(Homo sapiens (Human))
BDBM247960
(US9434724, 34)
Show SMILES COc1ccc2[nH]cc(C(=O)OCC34CCN(CC3)CC4)c2c1C
Show InChI InChI=1S/C19H24N2O3/c1-13-16(23-2)4-3-15-17(13)14(11-20-15)18(22)24-12-19-5-8-21(9-6-19)10-7-19/h3-4,11,20H,5-10,12H2,1-2H3
US Patent
n/an/a>1.00E+4n/an/an/an/an/an/a
ALPHARMAGEN, LLC
US Patent
Assay Description
Protocol 2: Stock solution for NCEs (test articles) and standard inhibitors were prepared at a concentration of 20 mM in DMSO. Stock solutions were d...
US Patent US9434724 (2016)
BindingDB Entry DOI: 10.7270/Q2M32TPW