BDBM248009 US9434724, 18
SMILES: COc1ccc2[nH]cc(C(=O)OCC34CCN(CC3)CC4)c2c1
InChI Key: InChIKey=TVBLCSQOLNHLAF-UHFFFAOYSA-N
Data: 1 KI  6 IC50
Activity Spreadsheet -- Enzyme Inhibition Constant Data from BindingDB
Found 6 hits for monomerid = 248009
Trg + Lig
Ki
nM
ΔG°
kcal/mole
IC50
nM
Kd
nM
EC50/IC50
nM
koff
s-1
kon
M-1s-1
pHTemp
°C
Neuronal acetylcholine receptor
(Rattus norvegicus (Rat))
BDBM248009
(US9434724, 18)
Show SMILES COc1ccc2[nH]cc(C(=O)OCC34CCN(CC3)CC4)c2c1
Show InChI InChI=1S/C18H22N2O3/c1-22-13-2-3-16-14(10-13)15(11-19-16)17(21)23-12-18-4-7-20(8-5-18)9-6-18/h2-3,10-11,19H,4-9,12H2,1H3
Reactome pathway
US Patent
28.3 -10.7 32.6n/an/an/an/a7.437
ALPHARMAGEN, LLC
US Patent
Assay Description
Protocol 1: The assay was conducted following the literature reference Meyer E. M., et al., Analysis of 3-(4-Hydroxy, 2-Methoxybenzylidene) Anabasein...
US Patent US9434724 (2016)
BindingDB Entry DOI: 10.7270/Q2M32TPW
Cytochrome P450 2C19
(Homo sapiens (Human))
BDBM248009
(US9434724, 18)
Show SMILES COc1ccc2[nH]cc(C(=O)OCC34CCN(CC3)CC4)c2c1
Show InChI InChI=1S/C18H22N2O3/c1-22-13-2-3-16-14(10-13)15(11-19-16)17(21)23-12-18-4-7-20(8-5-18)9-6-18/h2-3,10-11,19H,4-9,12H2,1H3
Reactome pathway
US Patent
n/an/a>1.00E+4n/an/an/an/an/an/a
ALPHARMAGEN, LLC
US Patent
Assay Description
Protocol 2: Stock solution for NCEs (test articles) and standard inhibitors were prepared at a concentration of 20 mM in DMSO. Stock solutions were d...
US Patent US9434724 (2016)
BindingDB Entry DOI: 10.7270/Q2M32TPW
Cytochrome P450 1A
(Homo sapiens (Human))
BDBM248009
(US9434724, 18)
Show SMILES COc1ccc2[nH]cc(C(=O)OCC34CCN(CC3)CC4)c2c1
Show InChI InChI=1S/C18H22N2O3/c1-22-13-2-3-16-14(10-13)15(11-19-16)17(21)23-12-18-4-7-20(8-5-18)9-6-18/h2-3,10-11,19H,4-9,12H2,1H3
Reactome pathway
US Patent
n/an/a>1.00E+4n/an/an/an/an/an/a
ALPHARMAGEN, LLC
US Patent
Assay Description
Protocol 2: Stock solution for NCEs (test articles) and standard inhibitors were prepared at a concentration of 20 mM in DMSO. Stock solutions were d...
US Patent US9434724 (2016)
BindingDB Entry DOI: 10.7270/Q2M32TPW
Cytochrome P450 2C9
(Homo sapiens (Human))
BDBM248009
(US9434724, 18)
Show SMILES COc1ccc2[nH]cc(C(=O)OCC34CCN(CC3)CC4)c2c1
Show InChI InChI=1S/C18H22N2O3/c1-22-13-2-3-16-14(10-13)15(11-19-16)17(21)23-12-18-4-7-20(8-5-18)9-6-18/h2-3,10-11,19H,4-9,12H2,1H3
Reactome pathway
US Patent
n/an/a>1.00E+4n/an/an/an/an/an/a
ALPHARMAGEN, LLC
US Patent
Assay Description
Protocol 2: Stock solution for NCEs (test articles) and standard inhibitors were prepared at a concentration of 20 mM in DMSO. Stock solutions were d...
US Patent US9434724 (2016)
BindingDB Entry DOI: 10.7270/Q2M32TPW
Cytochrome P450 3A4
(Homo sapiens (Human))
BDBM248009
(US9434724, 18)
Show SMILES COc1ccc2[nH]cc(C(=O)OCC34CCN(CC3)CC4)c2c1
Show InChI InChI=1S/C18H22N2O3/c1-22-13-2-3-16-14(10-13)15(11-19-16)17(21)23-12-18-4-7-20(8-5-18)9-6-18/h2-3,10-11,19H,4-9,12H2,1H3
Reactome pathway
US Patent
n/an/a>1.00E+4n/an/an/an/an/an/a
ALPHARMAGEN, LLC
US Patent
Assay Description
Protocol 2: Stock solution for NCEs (test articles) and standard inhibitors were prepared at a concentration of 20 mM in DMSO. Stock solutions were d...
US Patent US9434724 (2016)
BindingDB Entry DOI: 10.7270/Q2M32TPW
Cytochrome P450 2D6
(Homo sapiens (Human))
BDBM248009
(US9434724, 18)
Show SMILES COc1ccc2[nH]cc(C(=O)OCC34CCN(CC3)CC4)c2c1
Show InChI InChI=1S/C18H22N2O3/c1-22-13-2-3-16-14(10-13)15(11-19-16)17(21)23-12-18-4-7-20(8-5-18)9-6-18/h2-3,10-11,19H,4-9,12H2,1H3
US Patent
n/an/a>1.00E+4n/an/an/an/an/an/a
ALPHARMAGEN, LLC
US Patent
Assay Description
Protocol 2: Stock solution for NCEs (test articles) and standard inhibitors were prepared at a concentration of 20 mM in DMSO. Stock solutions were d...
US Patent US9434724 (2016)
BindingDB Entry DOI: 10.7270/Q2M32TPW