BDBM248028 US9434724, 55
SMILES: Cc1cc2c(c[nH]c2cc1O)C(=O)OCC12CCN(CC1)CC2
InChI Key: InChIKey=FXGCQUWMOXWKQZ-UHFFFAOYSA-N
Data: 1 KI  7 IC50
Activity Spreadsheet -- Enzyme Inhibition Constant Data from BindingDB
Found 7 hits for monomerid = 248028
Trg + Lig
Ki
nM
ΔG°
kcal/mole
IC50
nM
Kd
nM
EC50/IC50
nM
koff
s-1
kon
M-1s-1
pHTemp
°C
Neuronal acetylcholine receptor
(Rattus norvegicus (Rat))
BDBM248028
(US9434724, 55)
Show SMILES Cc1cc2c(c[nH]c2cc1O)C(=O)OCC12CCN(CC1)CC2
Show InChI InChI=1S/C18H22N2O3/c1-12-8-13-14(10-19-15(13)9-16(12)21)17(22)23-11-18-2-5-20(6-3-18)7-4-18/h8-10,19,21H,2-7,11H2,1H3
Reactome pathway
US Patent
44.8 -10.4 52.3n/an/an/an/a7.437
ALPHARMAGEN, LLC
US Patent
Assay Description
Protocol 1: The assay was conducted following the literature reference Meyer E. M., et al., Analysis of 3-(4-Hydroxy, 2-Methoxybenzylidene) Anabasein...
US Patent US9434724 (2016)
BindingDB Entry DOI: 10.7270/Q2M32TPW
Cytochrome P450 3A4
(Homo sapiens (Human))
BDBM248028
(US9434724, 55)
Show SMILES Cc1cc2c(c[nH]c2cc1O)C(=O)OCC12CCN(CC1)CC2
Show InChI InChI=1S/C18H22N2O3/c1-12-8-13-14(10-19-15(13)9-16(12)21)17(22)23-11-18-2-5-20(6-3-18)7-4-18/h8-10,19,21H,2-7,11H2,1H3
Reactome pathway
US Patent
n/an/a>1.00E+4n/an/an/an/an/a37
ALPHARMAGEN, LLC
US Patent
Assay Description
Protocol 1: Studies were carried out in human liver microsomes. Human liver microsomes were purchased from BD Gentest. DMSO stocks were prepared for ...
US Patent US9434724 (2016)
BindingDB Entry DOI: 10.7270/Q2M32TPW
Cytochrome P450 2C19
(Homo sapiens (Human))
BDBM248028
(US9434724, 55)
Show SMILES Cc1cc2c(c[nH]c2cc1O)C(=O)OCC12CCN(CC1)CC2
Show InChI InChI=1S/C18H22N2O3/c1-12-8-13-14(10-19-15(13)9-16(12)21)17(22)23-11-18-2-5-20(6-3-18)7-4-18/h8-10,19,21H,2-7,11H2,1H3
Reactome pathway
US Patent
n/an/a>1.00E+4n/an/an/an/an/a37
ALPHARMAGEN, LLC
US Patent
Assay Description
Protocol 1: Studies were carried out in human liver microsomes. Human liver microsomes were purchased from BD Gentest. DMSO stocks were prepared for ...
US Patent US9434724 (2016)
BindingDB Entry DOI: 10.7270/Q2M32TPW
Cytochrome P450 1A
(Homo sapiens (Human))
BDBM248028
(US9434724, 55)
Show SMILES Cc1cc2c(c[nH]c2cc1O)C(=O)OCC12CCN(CC1)CC2
Show InChI InChI=1S/C18H22N2O3/c1-12-8-13-14(10-19-15(13)9-16(12)21)17(22)23-11-18-2-5-20(6-3-18)7-4-18/h8-10,19,21H,2-7,11H2,1H3
Reactome pathway
US Patent
n/an/a>1.00E+4n/an/an/an/an/a37
ALPHARMAGEN, LLC
US Patent
Assay Description
Protocol 1: Studies were carried out in human liver microsomes. Human liver microsomes were purchased from BD Gentest. DMSO stocks were prepared for ...
US Patent US9434724 (2016)
BindingDB Entry DOI: 10.7270/Q2M32TPW
Cytochrome P450 2C9
(Homo sapiens (Human))
BDBM248028
(US9434724, 55)
Show SMILES Cc1cc2c(c[nH]c2cc1O)C(=O)OCC12CCN(CC1)CC2
Show InChI InChI=1S/C18H22N2O3/c1-12-8-13-14(10-19-15(13)9-16(12)21)17(22)23-11-18-2-5-20(6-3-18)7-4-18/h8-10,19,21H,2-7,11H2,1H3
Reactome pathway
US Patent
n/an/a>1.00E+4n/an/an/an/an/a37
ALPHARMAGEN, LLC
US Patent
Assay Description
Protocol 1: Studies were carried out in human liver microsomes. Human liver microsomes were purchased from BD Gentest. DMSO stocks were prepared for ...
US Patent US9434724 (2016)
BindingDB Entry DOI: 10.7270/Q2M32TPW
Cytochrome P450 3A4
(Homo sapiens (Human))
BDBM248028
(US9434724, 55)
Show SMILES Cc1cc2c(c[nH]c2cc1O)C(=O)OCC12CCN(CC1)CC2
Show InChI InChI=1S/C18H22N2O3/c1-12-8-13-14(10-19-15(13)9-16(12)21)17(22)23-11-18-2-5-20(6-3-18)7-4-18/h8-10,19,21H,2-7,11H2,1H3
Reactome pathway
US Patent
n/an/a>1.00E+4n/an/an/an/an/a37
ALPHARMAGEN, LLC
US Patent
Assay Description
Protocol 1: Studies were carried out in human liver microsomes. Human liver microsomes were purchased from BD Gentest. DMSO stocks were prepared for ...
US Patent US9434724 (2016)
BindingDB Entry DOI: 10.7270/Q2M32TPW
Cytochrome P450 2D6
(Homo sapiens (Human))
BDBM248028
(US9434724, 55)
Show SMILES Cc1cc2c(c[nH]c2cc1O)C(=O)OCC12CCN(CC1)CC2
Show InChI InChI=1S/C18H22N2O3/c1-12-8-13-14(10-19-15(13)9-16(12)21)17(22)23-11-18-2-5-20(6-3-18)7-4-18/h8-10,19,21H,2-7,11H2,1H3
US Patent
n/an/a>1.00E+4n/an/an/an/an/a37
ALPHARMAGEN, LLC
US Patent
Assay Description
Protocol 1: Studies were carried out in human liver microsomes. Human liver microsomes were purchased from BD Gentest. DMSO stocks were prepared for ...
US Patent US9434724 (2016)
BindingDB Entry DOI: 10.7270/Q2M32TPW