null
SMILES: CSC(=S)NC1Cc2ccccc2C1
InChI Key: InChIKey=AWRSIUAOACBAOQ-UHFFFAOYSA-N
Activity Spreadsheet -- Enzyme Inhibition Constant Data from BindingDB
Found 1 hit for monomerid = 24817
Trg + Lig
Ki
nM
ΔG°
kcal/mole
IC50
nM
Kd
nM
EC50/IC50
nM
koff
s-1
kon
M-1s-1
pHTemp
°C
Indoleamine 2,3-dioxygenase 1
(Homo sapiens (Human))
BDBM24817
(Brassinin derivative, 5 | N-(2,3-dihydro-1H-inden-...)
Show SMILES CSC(=S)NC1Cc2ccccc2C1
Show InChI InChI=1S/C11H13NS2/c1-14-11(13)12-10-6-8-4-2-3-5-9(8)7-10/h2-5,10H,6-7H2,1H3,(H,12,13)
Reactome pathway
4.21E+4 -6.21n/an/an/an/an/a6.537
Bryn Mawr College
Assay Description
The IC50 inhibition assays were performed in a 96-well microtiter plate format using purified recombinant IDO, which was added to the substrate, L-tr...
J Med Chem 49: 684-92 (2006)
Article DOI: 10.1021/jm0508888
BindingDB Entry DOI: 10.7270/Q2QR4VDZ