null
SMILES: S=C(NCCc1c[nH]c2ccccc12)SCc1ccccc1
InChI Key: InChIKey=WHLCMCCDKKEPEY-UHFFFAOYSA-N
Activity Spreadsheet -- Enzyme Inhibition Constant Data from BindingDB
Found 1 hit for monomerid = 24827
Trg + Lig
Ki
nM
ΔG°
kcal/mole
IC50
nM
Kd
nM
EC50/IC50
nM
koff
s-1
kon
M-1s-1
pHTemp
°C
Indoleamine 2,3-dioxygenase 1
(Homo sapiens (Human))
BDBM24827
((benzylsulfanyl)-N-[2-(1H-indol-3-yl)ethyl]carboth...)
Show SMILES S=C(NCCc1c[nH]c2ccccc12)SCc1ccccc1
Show InChI InChI=1S/C18H18N2S2/c21-18(22-13-14-6-2-1-3-7-14)19-11-10-15-12-20-17-9-5-4-8-16(15)17/h1-9,12,20H,10-11,13H2,(H,19,21)
Reactome pathway
1.72E+4 -6.76n/an/an/an/an/a6.537
Bryn Mawr College
Assay Description
The IC50 inhibition assays were performed in a 96-well microtiter plate format using purified recombinant IDO, which was added to the substrate, L-tr...
J Med Chem 49: 684-92 (2006)
Article DOI: 10.1021/jm0508888
BindingDB Entry DOI: 10.7270/Q2QR4VDZ