null
SMILES: CSC(=O)NCc1c[nH]c2ccccc12
InChI Key: InChIKey=GHGDPZHQDKPWOJ-UHFFFAOYSA-N
Activity Spreadsheet -- Enzyme Inhibition Constant Data from BindingDB
Found 1 hit for monomerid = 24833
Trg + Lig
Ki
nM
ΔG°
kcal/mole
IC50
nM
Kd
nM
EC50/IC50
nM
koff
s-1
kon
M-1s-1
pHTemp
°C
Indoleamine 2,3-dioxygenase 1
(Homo sapiens (Human))
BDBM24833
(N-(1H-indol-3-ylmethyl)(methylsulfanyl)formamide |...)
Show SMILES CSC(=O)NCc1c[nH]c2ccccc12
Show InChI InChI=1S/C11H12N2OS/c1-15-11(14)13-7-8-6-12-10-5-3-2-4-9(8)10/h2-6,12H,7H2,1H3,(H,13,14)
Reactome pathway
n/an/an/an/an/an/an/a6.537
Bryn Mawr College
Assay Description
The IC50 inhibition assays were performed in a 96-well microtiter plate format using purified recombinant IDO, which was added to the substrate, L-tr...
J Med Chem 49: 684-92 (2006)
Article DOI: 10.1021/jm0508888
BindingDB Entry DOI: 10.7270/Q2QR4VDZ