null
SMILES: Cc1nc(Cc2c[nH]c3ccccc23)cs1
InChI Key: InChIKey=HGYKXFGBOKPDMW-UHFFFAOYSA-N
Activity Spreadsheet -- Enzyme Inhibition Constant Data from BindingDB
Found 1 hit for monomerid = 24836
Trg + Lig
Ki
nM
ΔG°
kcal/mole
IC50
nM
Kd
nM
EC50/IC50
nM
koff
s-1
kon
M-1s-1
pHTemp
°C
Indoleamine 2,3-dioxygenase 1
(Homo sapiens (Human))
BDBM24836
(4-(1H-indol-3-ylmethyl)-2-methyl-1,3-thiazole | th...)
Show SMILES Cc1nc(Cc2c[nH]c3ccccc23)cs1
Show InChI InChI=1S/C13H12N2S/c1-9-15-11(8-16-9)6-10-7-14-13-5-3-2-4-12(10)13/h2-5,7-8,14H,6H2,1H3
Reactome pathway
3.29E+5 -4.94n/an/an/an/an/a6.537
Bryn Mawr College
Assay Description
The IC50 inhibition assays were performed in a 96-well microtiter plate format using purified recombinant IDO, which was added to the substrate, L-tr...
J Med Chem 49: 684-92 (2006)
Article DOI: 10.1021/jm0508888
BindingDB Entry DOI: 10.7270/Q2QR4VDZ