BDBM249007 US9434725, 238
SMILES: Cc1cncc(n1)-c1cc2n(ncc2cn1)-c1cnc(C2CC2)c(n1)N1CCC[C@H](N)C1
InChI Key: InChIKey=VPGFPXLEFFWPKW-KRWDZBQOSA-N
Data: 3 KI
Activity Spreadsheet -- Enzyme Inhibition Constant Data from BindingDB
Found 3 hits for monomerid = 249007
Trg + Lig
Ki
nM
ΔG°
kcal/mole
IC50
nM
Kd
nM
EC50/IC50
nM
koff
s-1
kon
M-1s-1
pHTemp
°C
Serine/threonine-protein kinase pim-1
(Homo sapiens (Human))
BDBM249007
(US9434725, 238)
Show SMILES Cc1cncc(n1)-c1cc2n(ncc2cn1)-c1cnc(C2CC2)c(n1)N1CCC[C@H](N)C1 |r|
Show InChI InChI=1S/C23H25N9/c1-14-8-25-11-19(29-14)18-7-20-16(9-26-18)10-28-32(20)21-12-27-22(15-4-5-15)23(30-21)31-6-2-3-17(24)13-31/h7-12,15,17H,2-6,13,24H2,1H3/t17-/m0/s1
US Patent
0.0260 -14.4n/an/an/an/an/a7.225
F. HOFFMANN-LA ROCHE AG
US Patent
Assay Description
PIM-1, -2, and -3 enzymes were generated as fusion proteins expressed in bacteria and purified by IMAC column chromatography (Sun, X., Chiu, J. F., a...
US Patent US9434725 (2016)
BindingDB Entry DOI: 10.7270/Q2CF9P1N
Serine/threonine-protein kinase pim-3
(Homo sapiens (Human))
BDBM249007
(US9434725, 238)
Show SMILES Cc1cncc(n1)-c1cc2n(ncc2cn1)-c1cnc(C2CC2)c(n1)N1CCC[C@H](N)C1 |r|
Show InChI InChI=1S/C23H25N9/c1-14-8-25-11-19(29-14)18-7-20-16(9-26-18)10-28-32(20)21-12-27-22(15-4-5-15)23(30-21)31-6-2-3-17(24)13-31/h7-12,15,17H,2-6,13,24H2,1H3/t17-/m0/s1
US Patent
0.0320 -14.3n/an/an/an/an/a7.225
F. HOFFMANN-LA ROCHE AG
US Patent
Assay Description
PIM-1, -2, and -3 enzymes were generated as fusion proteins expressed in bacteria and purified by IMAC column chromatography (Sun, X., Chiu, J. F., a...
US Patent US9434725 (2016)
BindingDB Entry DOI: 10.7270/Q2CF9P1N
Serine/threonine-protein kinase pim-2
(Homo sapiens (Human))
BDBM249007
(US9434725, 238)
Show SMILES Cc1cncc(n1)-c1cc2n(ncc2cn1)-c1cnc(C2CC2)c(n1)N1CCC[C@H](N)C1 |r|
Show InChI InChI=1S/C23H25N9/c1-14-8-25-11-19(29-14)18-7-20-16(9-26-18)10-28-32(20)21-12-27-22(15-4-5-15)23(30-21)31-6-2-3-17(24)13-31/h7-12,15,17H,2-6,13,24H2,1H3/t17-/m0/s1
US Patent
0.257 -13.1n/an/an/an/an/a7.225
F. HOFFMANN-LA ROCHE AG
US Patent
Assay Description
PIM-1, -2, and -3 enzymes were generated as fusion proteins expressed in bacteria and purified by IMAC column chromatography (Sun, X., Chiu, J. F., a...
US Patent US9434725 (2016)
BindingDB Entry DOI: 10.7270/Q2CF9P1N