BDBM249134 US9453038, 10
SMILES: COC(=O)CCc1ccc(nc1)-c1cc2cc(Oc3ccc(nc3)C(=O)N3CCC3)c(cc2[nH]1)C1CCCN1C(C)=O
InChI Key:
Data: 1 EC50
Activity Spreadsheet -- Enzyme Inhibition Constant Data from BindingDB
Found 1 hit for monomerid = 249134
Trg + Lig
Ki
nM
ΔG°
kcal/mole
IC50
nM
Kd
nM
EC50/IC50
nM
koff
s-1
kon
M-1s-1
pHTemp
°C
Glucokinase/Glucokinase regulatory protein
(Homo sapiens (Human))
BDBM249134
(US9453038, 10)
Show SMILES COC(=O)CCc1ccc(nc1)-c1cc2cc(Oc3ccc(nc3)C(=O)N3CCC3)c(cc2[nH]1)C1CCCN1C(C)=O
NCI pathway
Reactome pathway
US Patent
n/an/an/an/a 13.9n/an/an/a30
Merck Sharp & Dohme Corp.
US Patent
Assay Description
To test the exemplified compounds, the following assay was employed. Recombinant human liver glucokinase was expressed as a FLAG fusion protein in E....
US Patent US9453038 (2016)
BindingDB Entry DOI: 10.7270/Q23X85KK