BDBM249147 US9453038, 25
SMILES: COC(=O)Cc1ccc(Oc2cc3cc([nH]c3cc2C2CCC(=O)N2C)-c2ccccn2)cc1
InChI Key:
Data: 1 EC50
Activity Spreadsheet -- Enzyme Inhibition Constant Data from BindingDB
Found 1 hit for monomerid = 249147
Trg + Lig
Ki
nM
ΔG°
kcal/mole
IC50
nM
Kd
nM
EC50/IC50
nM
koff
s-1
kon
M-1s-1
pHTemp
°C
Hexokinase-4
(Homo sapiens (Human))
BDBM249147
(US9453038, 25)
Show SMILES COC(=O)Cc1ccc(Oc2cc3cc([nH]c3cc2C2CCC(=O)N2C)-c2ccccn2)cc1
NCI pathway
Reactome pathway
US Patent
n/an/an/an/a 21n/an/an/a30
Merck Sharp & Dohme Corp.
US Patent
Assay Description
To test the exemplified compounds, the following assay was employed. Recombinant human liver glucokinase was expressed as a FLAG fusion protein in E....
US Patent US9453038 (2016)
BindingDB Entry DOI: 10.7270/Q23X85KK