BDBM24925 3-methyl-1-phenyl-N-[(1S)-1-phenylethyl]-1H-pyrazolo[4,3-c]pyridin-6-amine::BMCL185648 Compound 1::pyrazolopyridine-based compound, 1
SMILES: C[C@H](Nc1cc2n(nc(C)c2cn1)-c1ccccc1)c1ccccc1
InChI Key: InChIKey=DJNPBANWRKSHQM-HNNXBMFYSA-N
Data: 2 IC50
PDB links: 2 PDB IDs contain this monomer as substructures. 2 PDB IDs contain inhibitors having a similarity of 90% to this monomer.
Activity Spreadsheet -- Enzyme Inhibition Constant Data from BindingDB
Found 2 hits for monomerid = 24925
Trg + Lig
Ki
nM
ΔG°
kcal/mole
IC50
nM
Kd
nM
EC50/IC50
nM
koff
s-1
kon
M-1s-1
pHTemp
°C
Serine/threonine-protein kinase PLK1
(Homo sapiens (Human))
BDBM24925
(3-methyl-1-phenyl-N-[(1S)-1-phenylethyl]-1H-pyrazo...)
Show SMILES C[C@H](Nc1cc2n(nc(C)c2cn1)-c1ccccc1)c1ccccc1 |r|
Show InChI InChI=1S/C21H20N4/c1-15(17-9-5-3-6-10-17)23-21-13-20-19(14-22-21)16(2)24-25(20)18-11-7-4-8-12-18/h3-15H,1-2H3,(H,22,23)/t15-/m0/s1
NCI pathway
Reactome pathway
n/an/a 1.30E+3n/an/an/an/a7.230
Sunesis Pharmaceuticals
Assay Description
An IMAP fluorescence polarization-based assay format (Molecular Devices) was used to determine the ability of compounds to inhibit the phosphorylatio...
Bioorg Med Chem Lett 18: 5186-9 (2008)
Article DOI: 10.1016/j.bmcl.2008.08.091
BindingDB Entry DOI: 10.7270/Q22Z13T8
Serine/threonine-protein kinase PLK1
(Homo sapiens (Human))
BDBM24925
(3-methyl-1-phenyl-N-[(1S)-1-phenylethyl]-1H-pyrazo...)
Show SMILES C[C@H](Nc1cc2n(nc(C)c2cn1)-c1ccccc1)c1ccccc1 |r|
Show InChI InChI=1S/C21H20N4/c1-15(17-9-5-3-6-10-17)23-21-13-20-19(14-22-21)16(2)24-25(20)18-11-7-4-8-12-18/h3-15H,1-2H3,(H,22,23)/t15-/m0/s1
NCI pathway
Reactome pathway
n/an/a 1.30E+3n/an/an/an/a7.230
Sunesis Pharmaceuticals
Assay Description
An IMAP fluorescence polarization-based assay format (Molecular Devices) was used to determine the ability of compounds to inhibit the phosphorylatio...
Bioorg Med Chem Lett 18: 5648-52 (2008)
Article DOI: 10.1016/j.bmcl.2008.08.095
BindingDB Entry DOI: 10.7270/Q29C6VRP