BDBM249311 US10017501, Compound 1020-239::US9458145, 1020-239
SMILES: Cc1noc(C)c1-c1cc(c2nc([nH]c2c1)C1CC1)C(O)(c1ccccn1)c1ncccn1
InChI Key:
Data: 2 KI  2 IC50
Activity Spreadsheet -- Enzyme Inhibition Constant Data from BindingDB
Found 4 hits for monomerid = 249311
Trg + Lig
Ki
nM
ΔG°
kcal/mole
IC50
nM
Kd
nM
EC50/IC50
nM
koff
s-1
kon
M-1s-1
pHTemp
°C
Bromodomain-containing protein 4 Bromo 1 domain(BRD4 BD1)
(Homo sapiens (Human))
BDBM249311
(US10017501, Compound 1020-239 | US9458145, 1020-23...)
Show SMILES Cc1noc(C)c1-c1cc(c2nc([nH]c2c1)C1CC1)C(O)(c1ccccn1)c1ncccn1
US Patent
5.90n/an/an/an/an/an/an/an/a
Gilead Sciences Inc
US Patent
Assay Description
Binding of the two tandem bromodomains, BRD4-1 and BRD4-2, to an acetylated histone H4 peptide was measured using a homogeneous time resolved fluores...
US Patent US10017501 (2018)
BindingDB Entry DOI: 10.7270/Q2CV4M3Z
Bromodomain-containing protein 4 Bromo 2 domain(BRD4 BD2)
(Homo sapiens (Human))
BDBM249311
(US10017501, Compound 1020-239 | US9458145, 1020-23...)
Show SMILES Cc1noc(C)c1-c1cc(c2nc([nH]c2c1)C1CC1)C(O)(c1ccccn1)c1ncccn1
US Patent
6n/an/an/an/an/an/an/an/a
Gilead Sciences Inc
US Patent
Assay Description
Binding of the two tandem bromodomains, BRD4-1 and BRD4-2, to an acetylated histone H4 peptide was measured using a homogeneous time resolved fluores...
US Patent US10017501 (2018)
BindingDB Entry DOI: 10.7270/Q2CV4M3Z
Bromodomain-containing protein 4 Bromo 1 domain(BRD4 BD1)
(Homo sapiens (Human))
BDBM249311
(US10017501, Compound 1020-239 | US9458145, 1020-23...)
Show SMILES Cc1noc(C)c1-c1cc(c2nc([nH]c2c1)C1CC1)C(O)(c1ccccn1)c1ncccn1
US Patent
n/an/a 5.90n/an/an/an/a7.525
Gilead Sciences, Inc.
US Patent
Assay Description
The labeled ligand specifically binds BRD4-1 and BRD4-2 and can be displaced by a small molecule inhibitor that shares a similar or overlapping bindi...
US Patent US9458145 (2016)
BindingDB Entry DOI: 10.7270/Q26Q1W53
Bromodomain-containing protein 4 Bromo 2 domain(BRD4 BD2)
(Homo sapiens (Human))
BDBM249311
(US10017501, Compound 1020-239 | US9458145, 1020-23...)
Show SMILES Cc1noc(C)c1-c1cc(c2nc([nH]c2c1)C1CC1)C(O)(c1ccccn1)c1ncccn1
US Patent
n/an/a 6n/an/an/an/a7.525
Gilead Sciences, Inc.
US Patent
Assay Description
The labeled ligand specifically binds BRD4-1 and BRD4-2 and can be displaced by a small molecule inhibitor that shares a similar or overlapping bindi...
US Patent US9458145 (2016)
BindingDB Entry DOI: 10.7270/Q26Q1W53