BDBM24943 20-methoxy-3,13-diazahexacyclo[14.8.0.0^{2,10}.0^{4,9}.0^{11,15}.0^{17,22}]tetracosa-1(16),2(10),4(9),5,7,11(15),17(22),18,20-nonaen-14-one::5-oxo dihydronaphthylcarbazole analogue, 8
SMILES: COc1ccc-2c(CCc3c-2c2C(=O)NCc2c2c4ccccc4[nH]c32)c1
InChI Key: InChIKey=PKGQDPNUCJTZSZ-UHFFFAOYSA-N
Data: 2 IC50
Activity Spreadsheet -- Enzyme Inhibition Constant Data from BindingDB
Found 2 hits for monomerid = 24943
Trg + Lig
Ki
nM
ΔG°
kcal/mole
IC50
nM
Kd
nM
EC50/IC50
nM
koff
s-1
kon
M-1s-1
pHTemp
°C
Mixed Lineage Kinase 3 (MLK3)
(Homo sapiens (Human))
BDBM24943
(20-methoxy-3,13-diazahexacyclo[14.8.0.0^{2,10}.0^{...)
Show SMILES COc1ccc-2c(CCc3c-2c2C(=O)NCc2c2c4ccccc4[nH]c32)c1
Show InChI InChI=1S/C23H18N2O2/c1-27-13-7-9-14-12(10-13)6-8-16-19(14)21-17(11-24-23(21)26)20-15-4-2-3-5-18(15)25-22(16)20/h2-5,7,9-10,25H,6,8,11H2,1H3,(H,24,26)
NCI pathway
n/an/a 274n/an/an/an/a7.237
Cephalon
Assay Description
The MLK kinase assays were performed by using the Millipore multiscreen trichloroacetic acid (TCA) in-plate format. The inhibition curves were genera...
J Med Chem 51: 5680-9 (2008)
Article DOI: 10.1021/jm8005838
BindingDB Entry DOI: 10.7270/Q2TH8K09
Mixed Lineage Kinase 1 (MLK1)
(Homo sapiens (Human))
BDBM24943
(20-methoxy-3,13-diazahexacyclo[14.8.0.0^{2,10}.0^{...)
Show SMILES COc1ccc-2c(CCc3c-2c2C(=O)NCc2c2c4ccccc4[nH]c32)c1
Show InChI InChI=1S/C23H18N2O2/c1-27-13-7-9-14-12(10-13)6-8-16-19(14)21-17(11-24-23(21)26)20-15-4-2-3-5-18(15)25-22(16)20/h2-5,7,9-10,25H,6,8,11H2,1H3,(H,24,26)
n/an/a 188n/an/an/an/a7.237
Cephalon
Assay Description
The MLK kinase assays were performed by using the Millipore multiscreen trichloroacetic acid (TCA) in-plate format. The inhibition curves were genera...
J Med Chem 51: 5680-9 (2008)
Article DOI: 10.1021/jm8005838
BindingDB Entry DOI: 10.7270/Q2TH8K09