null
SMILES: CS(=O)(=O)N1CCc2[nH]nc(C(=O)N3CCC(CC3)c3cccc(F)c3C(F)(F)F)c2C1
InChI Key: InChIKey=HNGOJYLRHLPAME-UHFFFAOYSA-N
Activity Spreadsheet -- Enzyme Inhibition Constant Data from BindingDB
Found 7 hits for monomerid = 249465
Trg + Lig
Ki
nM
ΔG°
kcal/mole
IC50
nM
Kd
nM
EC50/IC50
nM
koff
s-1
kon
M-1s-1
pHTemp
°C
Retinol-binding protein 4
(Homo sapiens (Human))
BDBM249465
(US10072016, Compound 64 | US10407433, Compound 64 ...)
Show SMILES CS(=O)(=O)N1CCc2[nH]nc(C(=O)N3CCC(CC3)c3cccc(F)c3C(F)(F)F)c2C1
Show InChI InChI=1S/C20H22F4N4O3S/c1-32(30,31)28-10-7-16-14(11-28)18(26-25-16)19(29)27-8-5-12(6-9-27)13-3-2-4-15(21)17(13)20(22,23)24/h2-4,12H,5-11H2,1H3,(H,25,26)
Reactome pathway
US Patent
n/an/a 5.36n/an/an/an/a7.44
THE TRUSTEES OF COLUMBIA UNIVERSITY IN THE CITY OF NEW YORK
US Patent
Assay Description
Untagged human RBP4 purified from urine of tubular proteinuria patients was purchased from Fitzgerald Industries International. It was biotinylated u...
US Patent US9434727 (2016)
BindingDB Entry DOI: 10.7270/Q2F76BGR
Retinol-binding protein 4
(Homo sapiens (Human))
BDBM249465
(US10072016, Compound 64 | US10407433, Compound 64 ...)
Show SMILES CS(=O)(=O)N1CCc2[nH]nc(C(=O)N3CCC(CC3)c3cccc(F)c3C(F)(F)F)c2C1
Show InChI InChI=1S/C20H22F4N4O3S/c1-32(30,31)28-10-7-16-14(11-28)18(26-25-16)19(29)27-8-5-12(6-9-27)13-3-2-4-15(21)17(13)20(22,23)24/h2-4,12H,5-11H2,1H3,(H,25,26)
Reactome pathway
US Patent
n/an/a 20.6n/an/an/an/a7.54
THE TRUSTEES OF COLUMBIA UNIVERSITY IN THE CITY OF NEW YORK
US Patent
Assay Description
TR-FRET assay for retinol-induced RBP4-TTR interaction Binding of a desired RBP4 antagonist displaces retinol and induces hindrance for RBP4-TTR inte...
US Patent US9434727 (2016)
BindingDB Entry DOI: 10.7270/Q2F76BGR
Retinol-binding protein 4
(Homo sapiens (Human))
BDBM249465
(US10072016, Compound 64 | US10407433, Compound 64 ...)
Show SMILES CS(=O)(=O)N1CCc2[nH]nc(C(=O)N3CCC(CC3)c3cccc(F)c3C(F)(F)F)c2C1
Show InChI InChI=1S/C20H22F4N4O3S/c1-32(30,31)28-10-7-16-14(11-28)18(26-25-16)19(29)27-8-5-12(6-9-27)13-3-2-4-15(21)17(13)20(22,23)24/h2-4,12H,5-11H2,1H3,(H,25,26)
Reactome pathway
US Patent
n/an/a 5.36n/an/an/an/a7.5n/a
THE TRUSTEES OF COLUMBIA UNIVERSITY IN THE CITY OF NEW YORK
US Patent
Assay Description
Binding of a desired RBP4 antagonist displaces retinol and induces hindrance for RBP4-TTR interaction resulting in the decreased FRET signal (FIG. 7)...
US Patent US10072016 (2018)
BindingDB Entry DOI: 10.7270/Q2QJ7KBT
Retinol-binding protein 4
(Homo sapiens (Human))
BDBM249465
(US10072016, Compound 64 | US10407433, Compound 64 ...)
Show SMILES CS(=O)(=O)N1CCc2[nH]nc(C(=O)N3CCC(CC3)c3cccc(F)c3C(F)(F)F)c2C1
Show InChI InChI=1S/C20H22F4N4O3S/c1-32(30,31)28-10-7-16-14(11-28)18(26-25-16)19(29)27-8-5-12(6-9-27)13-3-2-4-15(21)17(13)20(22,23)24/h2-4,12H,5-11H2,1H3,(H,25,26)
Reactome pathway
US Patent
n/an/a 5.36n/an/an/an/an/an/a
The Trustees of Columbia University in the City of New York
US Patent
Assay Description
Untagged human RBP4 purified from urine of tubular proteinuria patients was purchased from Fitzgerald Industries International. It was biotinylated u...
US Patent US10913746 (2021)
Retinol-binding protein 4
(Homo sapiens (Human))
BDBM249465
(US10072016, Compound 64 | US10407433, Compound 64 ...)
Show SMILES CS(=O)(=O)N1CCc2[nH]nc(C(=O)N3CCC(CC3)c3cccc(F)c3C(F)(F)F)c2C1
Show InChI InChI=1S/C20H22F4N4O3S/c1-32(30,31)28-10-7-16-14(11-28)18(26-25-16)19(29)27-8-5-12(6-9-27)13-3-2-4-15(21)17(13)20(22,23)24/h2-4,12H,5-11H2,1H3,(H,25,26)
Reactome pathway
US Patent
n/an/a 5.36n/an/an/an/an/an/a
THE TRUSTEES OF COLUMBIA UNIVERSITY IN THE CITY OF NEW YORK
US Patent
Assay Description
Untagged human RBP4 purified from urine of tubular proteinuria patients was purchased from Fitzgerald Industries International. It was biotinylated u...
US Patent US9777010 (2017)
BindingDB Entry DOI: 10.7270/Q22J6F0D
Retinol-binding protein 4
(Homo sapiens (Human))
BDBM249465
(US10072016, Compound 64 | US10407433, Compound 64 ...)
Show SMILES CS(=O)(=O)N1CCc2[nH]nc(C(=O)N3CCC(CC3)c3cccc(F)c3C(F)(F)F)c2C1
Show InChI InChI=1S/C20H22F4N4O3S/c1-32(30,31)28-10-7-16-14(11-28)18(26-25-16)19(29)27-8-5-12(6-9-27)13-3-2-4-15(21)17(13)20(22,23)24/h2-4,12H,5-11H2,1H3,(H,25,26)
Reactome pathway
US Patent
n/an/a 5.36n/an/an/an/an/an/a
The Trustees of Columbia University In The City of New York
US Patent
Assay Description
Untagged human RBP4 purified from urine of tubular proteinuria patients was purchased from Fitzgerald Industries International. It was biotinylated u...
US Patent US10407433 (2019)
BindingDB Entry DOI: 10.7270/Q2W95CKV
Transthyretin
(Homo sapiens (Human))
BDBM249465
(US10072016, Compound 64 | US10407433, Compound 64 ...)
Show SMILES CS(=O)(=O)N1CCc2[nH]nc(C(=O)N3CCC(CC3)c3cccc(F)c3C(F)(F)F)c2C1
Show InChI InChI=1S/C20H22F4N4O3S/c1-32(30,31)28-10-7-16-14(11-28)18(26-25-16)19(29)27-8-5-12(6-9-27)13-3-2-4-15(21)17(13)20(22,23)24/h2-4,12H,5-11H2,1H3,(H,25,26)
US Patent
n/an/a 20.6n/an/an/an/a7.425
THE TRUSTEES OF COLUMBIA UNIVERSITY IN THE CITY OF NEW YORK
US Patent
Assay Description
Untagged human RBP4 purified from urine of tubular proteinuria patients was purchased from Fitzgerald Industries International. It was biotinylated u...
US Patent US10072016 (2018)
BindingDB Entry DOI: 10.7270/Q2QJ7KBT