BDBM249534 US10072016, Compound 132::US10407433, Compound 132::US10913746, Compound 132::US9434727, 132::US9777010, Compound 132
SMILES: Fc1cc(F)c(c(c1)C1CCN(CC1)C(=O)c1nnc2ccc(cn12)C#N)C(F)(F)F
InChI Key: InChIKey=QUCUJWIXXDENAJ-UHFFFAOYSA-N
Data: 7 IC50
Activity Spreadsheet -- Enzyme Inhibition Constant Data from BindingDB
Found 7 hits for monomerid = 249534
Trg + Lig
Ki
nM
ΔG°
kcal/mole
IC50
nM
Kd
nM
EC50/IC50
nM
koff
s-1
kon
M-1s-1
pHTemp
°C
Retinol-binding protein 4
(Homo sapiens (Human))
BDBM249534
(US10072016, Compound 132 | US10407433, Compound 13...)
Show SMILES Fc1cc(F)c(c(c1)C1CCN(CC1)C(=O)c1nnc2ccc(cn12)C#N)C(F)(F)F
Show InChI InChI=1S/C20H14F5N5O/c21-13-7-14(17(15(22)8-13)20(23,24)25)12-3-5-29(6-4-12)19(31)18-28-27-16-2-1-11(9-26)10-30(16)18/h1-2,7-8,10,12H,3-6H2
Reactome pathway
US Patent
n/an/a 6.75n/an/an/an/a7.44
THE TRUSTEES OF COLUMBIA UNIVERSITY IN THE CITY OF NEW YORK
US Patent
Assay Description
Untagged human RBP4 purified from urine of tubular proteinuria patients was purchased from Fitzgerald Industries International. It was biotinylated u...
US Patent US9434727 (2016)
BindingDB Entry DOI: 10.7270/Q2F76BGR
Retinol-binding protein 4
(Homo sapiens (Human))
BDBM249534
(US10072016, Compound 132 | US10407433, Compound 13...)
Show SMILES Fc1cc(F)c(c(c1)C1CCN(CC1)C(=O)c1nnc2ccc(cn12)C#N)C(F)(F)F
Show InChI InChI=1S/C20H14F5N5O/c21-13-7-14(17(15(22)8-13)20(23,24)25)12-3-5-29(6-4-12)19(31)18-28-27-16-2-1-11(9-26)10-30(16)18/h1-2,7-8,10,12H,3-6H2
Reactome pathway
US Patent
n/an/a 10.5n/an/an/an/a7.54
THE TRUSTEES OF COLUMBIA UNIVERSITY IN THE CITY OF NEW YORK
US Patent
Assay Description
TR-FRET assay for retinol-induced RBP4-TTR interaction Binding of a desired RBP4 antagonist displaces retinol and induces hindrance for RBP4-TTR inte...
US Patent US9434727 (2016)
BindingDB Entry DOI: 10.7270/Q2F76BGR
Retinol-binding protein 4
(Homo sapiens (Human))
BDBM249534
(US10072016, Compound 132 | US10407433, Compound 13...)
Show SMILES Fc1cc(F)c(c(c1)C1CCN(CC1)C(=O)c1nnc2ccc(cn12)C#N)C(F)(F)F
Show InChI InChI=1S/C20H14F5N5O/c21-13-7-14(17(15(22)8-13)20(23,24)25)12-3-5-29(6-4-12)19(31)18-28-27-16-2-1-11(9-26)10-30(16)18/h1-2,7-8,10,12H,3-6H2
Reactome pathway
US Patent
n/an/a 6.75n/an/an/an/a7.5n/a
THE TRUSTEES OF COLUMBIA UNIVERSITY IN THE CITY OF NEW YORK
US Patent
Assay Description
Binding of a desired RBP4 antagonist displaces retinol and induces hindrance for RBP4-TTR interaction resulting in the decreased FRET signal (FIG. 7)...
US Patent US10072016 (2018)
BindingDB Entry DOI: 10.7270/Q2QJ7KBT
Retinol-binding protein 4
(Homo sapiens (Human))
BDBM249534
(US10072016, Compound 132 | US10407433, Compound 13...)
Show SMILES Fc1cc(F)c(c(c1)C1CCN(CC1)C(=O)c1nnc2ccc(cn12)C#N)C(F)(F)F
Show InChI InChI=1S/C20H14F5N5O/c21-13-7-14(17(15(22)8-13)20(23,24)25)12-3-5-29(6-4-12)19(31)18-28-27-16-2-1-11(9-26)10-30(16)18/h1-2,7-8,10,12H,3-6H2
Reactome pathway
US Patent
n/an/a 6.75n/an/an/an/an/an/a
The Trustees of Columbia University in the City of New York
US Patent
Assay Description
Untagged human RBP4 purified from urine of tubular proteinuria patients was purchased from Fitzgerald Industries International. It was biotinylated u...
US Patent US10913746 (2021)
spa binding assay for rbp4
(Homo sapiens (Human))
BDBM249534
(US10072016, Compound 132 | US10407433, Compound 13...)
Show SMILES Fc1cc(F)c(c(c1)C1CCN(CC1)C(=O)c1nnc2ccc(cn12)C#N)C(F)(F)F
Show InChI InChI=1S/C20H14F5N5O/c21-13-7-14(17(15(22)8-13)20(23,24)25)12-3-5-29(6-4-12)19(31)18-28-27-16-2-1-11(9-26)10-30(16)18/h1-2,7-8,10,12H,3-6H2
Reactome pathway
US Patent
n/an/a 6.75n/an/an/an/an/an/a
THE TRUSTEES OF COLUMBIA UNIVERSITY IN THE CITY OF NEW YORK
US Patent
Assay Description
Untagged human RBP4 purified from urine of tubular proteinuria patients was purchased from Fitzgerald Industries International. It was biotinylated u...
US Patent US9777010 (2017)
BindingDB Entry DOI: 10.7270/Q22J6F0D
Retinol-binding protein 4
(Homo sapiens (Human))
BDBM249534
(US10072016, Compound 132 | US10407433, Compound 13...)
Show SMILES Fc1cc(F)c(c(c1)C1CCN(CC1)C(=O)c1nnc2ccc(cn12)C#N)C(F)(F)F
Show InChI InChI=1S/C20H14F5N5O/c21-13-7-14(17(15(22)8-13)20(23,24)25)12-3-5-29(6-4-12)19(31)18-28-27-16-2-1-11(9-26)10-30(16)18/h1-2,7-8,10,12H,3-6H2
Reactome pathway
US Patent
n/an/a 6.75n/an/an/an/an/an/a
The Trustees of Columbia University In The City of New York
US Patent
Assay Description
Untagged human RBP4 purified from urine of tubular proteinuria patients was purchased from Fitzgerald Industries International. It was biotinylated u...
US Patent US10407433 (2019)
BindingDB Entry DOI: 10.7270/Q2W95CKV
Transthyretin
(Homo sapiens (Human))
BDBM249534
(US10072016, Compound 132 | US10407433, Compound 13...)
Show SMILES Fc1cc(F)c(c(c1)C1CCN(CC1)C(=O)c1nnc2ccc(cn12)C#N)C(F)(F)F
Show InChI InChI=1S/C20H14F5N5O/c21-13-7-14(17(15(22)8-13)20(23,24)25)12-3-5-29(6-4-12)19(31)18-28-27-16-2-1-11(9-26)10-30(16)18/h1-2,7-8,10,12H,3-6H2
US Patent
n/an/a 10.5n/an/an/an/a7.425
THE TRUSTEES OF COLUMBIA UNIVERSITY IN THE CITY OF NEW YORK
US Patent
Assay Description
Untagged human RBP4 purified from urine of tubular proteinuria patients was purchased from Fitzgerald Industries International. It was biotinylated u...
US Patent US10072016 (2018)
BindingDB Entry DOI: 10.7270/Q2QJ7KBT