BDBM249601 US9447038, 29
SMILES: CCc1cc(CN(CC2CCCC2)[C@H](CC(O)=O)c2ccc(Cl)cc2)ccc1OCCN1C(=O)CCC1=O
InChI Key: InChIKey=ZLWWAAACJPQOFS-AREMUKBSSA-N
Data: 1 IC50
Activity Spreadsheet -- Enzyme Inhibition Constant Data from BindingDB
Found 1 hit for monomerid = 249601
Trg + Lig
Ki
nM
ΔG°
kcal/mole
IC50
nM
Kd
nM
EC50/IC50
nM
koff
s-1
kon
M-1s-1
pHTemp
°C
C-X-C motif chemokine 10 (CXCL10)
(Homo sapiens (Human))
BDBM249601
(US9447038, 29)
Show SMILES CCc1cc(CN(CC2CCCC2)[C@H](CC(O)=O)c2ccc(Cl)cc2)ccc1OCCN1C(=O)CCC1=O |r|
Show InChI InChI=1S/C30H37ClN2O5/c1-2-23-17-22(7-12-27(23)38-16-15-33-28(34)13-14-29(33)35)20-32(19-21-5-3-4-6-21)26(18-30(36)37)24-8-10-25(31)11-9-24/h7-12,17,21,26H,2-6,13-16,18-20H2,1H3,(H,36,37)/t26-/m1/s1
US Patent
n/an/a 31n/an/an/an/an/a25
Sanofi
US Patent
Assay Description
The composition of the binding assay buffer is determined in a course of detailed optimization procedure. This resulted in a binding assay buffer con...
US Patent US9447038 (2016)
BindingDB Entry DOI: 10.7270/Q29G5KQK