null
SMILES: Brc1cccnc1C1N=C(Nc2nc3ccccc3o2)NC2=C1C(=O)CCC2
InChI Key: InChIKey=WAWXFFMFCHABBA-UHFFFAOYSA-N
Activity Spreadsheet -- Enzyme Inhibition Constant Data from BindingDB
Found 1 hit for monomerid = 249831
Trg + Lig
Ki
nM
ΔG°
kcal/mole
IC50
nM
Kd
nM
EC50/IC50
nM
koff
s-1
kon
M-1s-1
pHTemp
°C
Galactokinase
(Homo sapiens (Human))
BDBM249831
(US9447087, 67)
Show SMILES Brc1cccnc1C1N=C(Nc2nc3ccccc3o2)NC2=C1C(=O)CCC2 |c:24,t:9|
Show InChI InChI=1S/C20H16BrN5O2/c21-11-5-4-10-22-17(11)18-16-13(7-3-8-14(16)27)23-19(25-18)26-20-24-12-6-1-2-9-15(12)28-20/h1-2,4-6,9-10,18H,3,7-8H2,(H2,23,24,25,26)
US Patent
n/an/a 651n/an/an/an/an/an/a
UNIVERSITY OF UTAH RESEARCH FOUNDATION
US Patent
Assay Description
Assay details and protocol: The primary assay monitored ATP depletion using Promega's KinaseGlo technology, where ATP levels are measured through...
US Patent US9447087 (2016)
BindingDB Entry DOI: 10.7270/Q25Q4V08