BDBM24995 2-(4-amino-1,2,5-oxadiazol-3-yl)-1-ethyl-N-(piperidin-4-yl)-1H-imidazo[4,5-c]pyridine-7-carboxamide::oxadiazole-containing compound, 8
SMILES: CCn1c(nc2cncc(C(=O)NC3CCNCC3)c12)-c1nonc1N
InChI Key: InChIKey=LXUZPJDXRCSLIZ-UHFFFAOYSA-N
Data: 5 IC50
Activity Spreadsheet -- Enzyme Inhibition Constant Data from BindingDB
Found 5 hits for monomerid = 24995
Trg + Lig
Ki
nM
ΔG°
kcal/mole
IC50
nM
Kd
nM
EC50/IC50
nM
koff
s-1
kon
M-1s-1
pHTemp
°C
RAC-alpha serine/threonine-protein kinase
(Homo sapiens (Human))
BDBM24995
(2-(4-amino-1,2,5-oxadiazol-3-yl)-1-ethyl-N-(piperi...)
Show SMILES CCn1c(nc2cncc(C(=O)NC3CCNCC3)c12)-c1nonc1N
Show InChI InChI=1S/C16H20N8O2/c1-2-24-13-10(16(25)20-9-3-5-18-6-4-9)7-19-8-11(13)21-15(24)12-14(17)23-26-22-12/h7-9,18H,2-6H2,1H3,(H2,17,23)(H,20,25)
n/an/a 562n/an/an/an/a7.522
GlaxoSmithKline
Assay Description
IC50 is the inhibitor concentration, which inhibits 50% of kinase activity that catalyzes the transfer of the terminal phosphate from radiolabeled AT...
J Med Chem 51: 5663-79 (2008)
Article DOI: 10.1021/jm8004527
BindingDB Entry DOI: 10.7270/Q29G5K3H
Serine/threonine-protein kinase AKT2
(Homo sapiens (Human))
BDBM24995
(2-(4-amino-1,2,5-oxadiazol-3-yl)-1-ethyl-N-(piperi...)
Show SMILES CCn1c(nc2cncc(C(=O)NC3CCNCC3)c12)-c1nonc1N
Show InChI InChI=1S/C16H20N8O2/c1-2-24-13-10(16(25)20-9-3-5-18-6-4-9)7-19-8-11(13)21-15(24)12-14(17)23-26-22-12/h7-9,18H,2-6H2,1H3,(H2,17,23)(H,20,25)
n/an/a 2.57E+3n/an/an/an/an/an/a
GlaxoSmithKline
Assay Description
IC50 is the inhibitor concentration, which inhibits 50% of kinase activity that catalyzes the transfer of the terminal phosphate from radiolabeled AT...
J Med Chem 51: 5663-79 (2008)
Article DOI: 10.1021/jm8004527
BindingDB Entry DOI: 10.7270/Q29G5K3H
Rho-associated protein kinase 1 (ROCK I)
(Rattus norvegicus (Rat))
BDBM24995
(2-(4-amino-1,2,5-oxadiazol-3-yl)-1-ethyl-N-(piperi...)
Show SMILES CCn1c(nc2cncc(C(=O)NC3CCNCC3)c12)-c1nonc1N
Show InChI InChI=1S/C16H20N8O2/c1-2-24-13-10(16(25)20-9-3-5-18-6-4-9)7-19-8-11(13)21-15(24)12-14(17)23-26-22-12/h7-9,18H,2-6H2,1H3,(H2,17,23)(H,20,25)
n/an/a 6n/an/an/an/an/an/a
GlaxoSmithKline
Assay Description
IC50 is the inhibitor concentration, which inhibits 50% of kinase activity that catalyzes the transfer of the terminal phosphate from radiolabeled AT...
J Med Chem 51: 5663-79 (2008)
Article DOI: 10.1021/jm8004527
BindingDB Entry DOI: 10.7270/Q29G5K3H
Ribosomal protein S6 kinase alpha 5
(Homo sapiens (Human))
BDBM24995
(2-(4-amino-1,2,5-oxadiazol-3-yl)-1-ethyl-N-(piperi...)
Show SMILES CCn1c(nc2cncc(C(=O)NC3CCNCC3)c12)-c1nonc1N
Show InChI InChI=1S/C16H20N8O2/c1-2-24-13-10(16(25)20-9-3-5-18-6-4-9)7-19-8-11(13)21-15(24)12-14(17)23-26-22-12/h7-9,18H,2-6H2,1H3,(H2,17,23)(H,20,25)
NCI pathway
Reactome pathway
n/an/a 13n/an/an/an/an/an/a
GlaxoSmithKline
Assay Description
IC50 is the inhibitor concentration, which inhibits 50% of kinase activity that catalyzes the transfer of the terminal phosphate from radiolabeled AT...
J Med Chem 51: 5663-79 (2008)
Article DOI: 10.1021/jm8004527
BindingDB Entry DOI: 10.7270/Q29G5K3H
Serine/threonine-protein kinase AKT
(Homo sapiens (Human))
BDBM24995
(2-(4-amino-1,2,5-oxadiazol-3-yl)-1-ethyl-N-(piperi...)
Show SMILES CCn1c(nc2cncc(C(=O)NC3CCNCC3)c12)-c1nonc1N
Show InChI InChI=1S/C16H20N8O2/c1-2-24-13-10(16(25)20-9-3-5-18-6-4-9)7-19-8-11(13)21-15(24)12-14(17)23-26-22-12/h7-9,18H,2-6H2,1H3,(H2,17,23)(H,20,25)
NCI pathway
Reactome pathway
n/an/a 2.29E+3n/an/an/an/an/an/a
GlaxoSmithKline
Assay Description
IC50 is the inhibitor concentration, which inhibits 50% of kinase activity that catalyzes the transfer of the terminal phosphate from radiolabeled AT...
J Med Chem 51: 5663-79 (2008)
Article DOI: 10.1021/jm8004527
BindingDB Entry DOI: 10.7270/Q29G5K3H