BDBM25011 4-[2-(4-amino-1,2,5-oxadiazol-3-yl)-1-ethyl-7-(pyrrolidin-3-ylmethoxy)-1H-imidazo[4,5-c]pyridin-4-yl]-2-methylbut-3-yn-2-ol::oxadiazole-containing compound, 3e
SMILES: CCn1c(nc2c(ncc(OCC3CCNC3)c12)C#CC(C)(C)O)-c1nonc1N
InChI Key: InChIKey=ATYOXMQKXVJYSG-UHFFFAOYSA-N
Data: 2 IC50
Activity Spreadsheet -- Enzyme Inhibition Constant Data from BindingDB
Found 2 hits for monomerid = 25011
Trg + Lig
Ki
nM
ΔG°
kcal/mole
IC50
nM
Kd
nM
EC50/IC50
nM
koff
s-1
kon
M-1s-1
pHTemp
°C
Serine/threonine-protein kinase AKT2
(Homo sapiens (Human))
BDBM25011
(4-[2-(4-amino-1,2,5-oxadiazol-3-yl)-1-ethyl-7-(pyr...)
Show SMILES CCn1c(nc2c(ncc(OCC3CCNC3)c12)C#CC(C)(C)O)-c1nonc1N
Show InChI InChI=1S/C20H25N7O3/c1-4-27-17-14(29-11-12-6-8-22-9-12)10-23-13(5-7-20(2,3)28)15(17)24-19(27)16-18(21)26-30-25-16/h10,12,22,28H,4,6,8-9,11H2,1-3H3,(H2,21,26)
n/an/a 13n/an/an/an/an/an/a
GlaxoSmithKline
Assay Description
IC50 is the inhibitor concentration, which inhibits 50% of kinase activity that catalyzes the transfer of the terminal phosphate from radiolabeled AT...
J Med Chem 51: 5663-79 (2008)
Article DOI: 10.1021/jm8004527
BindingDB Entry DOI: 10.7270/Q29G5K3H
RAC-alpha serine/threonine-protein kinase
(Homo sapiens (Human))
BDBM25011
(4-[2-(4-amino-1,2,5-oxadiazol-3-yl)-1-ethyl-7-(pyr...)
Show SMILES CCn1c(nc2c(ncc(OCC3CCNC3)c12)C#CC(C)(C)O)-c1nonc1N
Show InChI InChI=1S/C20H25N7O3/c1-4-27-17-14(29-11-12-6-8-22-9-12)10-23-13(5-7-20(2,3)28)15(17)24-19(27)16-18(21)26-30-25-16/h10,12,22,28H,4,6,8-9,11H2,1-3H3,(H2,21,26)
n/an/a 8n/an/an/an/a7.522
GlaxoSmithKline
Assay Description
IC50 is the inhibitor concentration, which inhibits 50% of kinase activity that catalyzes the transfer of the terminal phosphate from radiolabeled AT...
J Med Chem 51: 5663-79 (2008)
Article DOI: 10.1021/jm8004527
BindingDB Entry DOI: 10.7270/Q29G5K3H