BDBM25015 4-[2-(4-amino-1,2,5-oxadiazol-3-yl)-1-ethyl-7-(3-{[2-(4-methoxyphenyl)ethyl]amino}propoxy)-1H-imidazo[4,5-c]pyridin-4-yl]-2-methylbut-3-yn-2-ol::oxadiazole-containing compound, 14a
SMILES: CCn1c(nc2c(ncc(OCCCNCCc3ccc(OC)cc3)c12)C#CC(C)(C)O)-c1nonc1N
InChI Key: InChIKey=JHMAEWUXAYBMPA-UHFFFAOYSA-N
Data: 3 IC50
Activity Spreadsheet -- Enzyme Inhibition Constant Data from BindingDB
Found 3 hits for monomerid = 25015
Trg + Lig
Ki
nM
ΔG°
kcal/mole
IC50
nM
Kd
nM
EC50/IC50
nM
koff
s-1
kon
M-1s-1
pHTemp
°C
RAC-alpha serine/threonine-protein kinase
(Homo sapiens (Human))
BDBM25015
(4-[2-(4-amino-1,2,5-oxadiazol-3-yl)-1-ethyl-7-(3-{...)
Show SMILES CCn1c(nc2c(ncc(OCCCNCCc3ccc(OC)cc3)c12)C#CC(C)(C)O)-c1nonc1N
Show InChI InChI=1S/C27H33N7O4/c1-5-34-24-21(37-16-6-14-29-15-12-18-7-9-19(36-4)10-8-18)17-30-20(11-13-27(2,3)35)22(24)31-26(34)23-25(28)33-38-32-23/h7-10,17,29,35H,5-6,12,14-16H2,1-4H3,(H2,28,33)
n/an/a 5n/an/an/an/a7.522
GlaxoSmithKline
Assay Description
IC50 is the inhibitor concentration, which inhibits 50% of kinase activity that catalyzes the transfer of the terminal phosphate from radiolabeled AT...
J Med Chem 51: 5663-79 (2008)
Article DOI: 10.1021/jm8004527
BindingDB Entry DOI: 10.7270/Q29G5K3H
Serine/threonine-protein kinase AKT
(Homo sapiens (Human))
BDBM25015
(4-[2-(4-amino-1,2,5-oxadiazol-3-yl)-1-ethyl-7-(3-{...)
Show SMILES CCn1c(nc2c(ncc(OCCCNCCc3ccc(OC)cc3)c12)C#CC(C)(C)O)-c1nonc1N
Show InChI InChI=1S/C27H33N7O4/c1-5-34-24-21(37-16-6-14-29-15-12-18-7-9-19(36-4)10-8-18)17-30-20(11-13-27(2,3)35)22(24)31-26(34)23-25(28)33-38-32-23/h7-10,17,29,35H,5-6,12,14-16H2,1-4H3,(H2,28,33)
NCI pathway
Reactome pathway
n/an/a 16n/an/an/an/an/an/a
GlaxoSmithKline
Assay Description
IC50 is the inhibitor concentration, which inhibits 50% of kinase activity that catalyzes the transfer of the terminal phosphate from radiolabeled AT...
J Med Chem 51: 5663-79 (2008)
Article DOI: 10.1021/jm8004527
BindingDB Entry DOI: 10.7270/Q29G5K3H
Serine/threonine-protein kinase AKT2
(Homo sapiens (Human))
BDBM25015
(4-[2-(4-amino-1,2,5-oxadiazol-3-yl)-1-ethyl-7-(3-{...)
Show SMILES CCn1c(nc2c(ncc(OCCCNCCc3ccc(OC)cc3)c12)C#CC(C)(C)O)-c1nonc1N
Show InChI InChI=1S/C27H33N7O4/c1-5-34-24-21(37-16-6-14-29-15-12-18-7-9-19(36-4)10-8-18)17-30-20(11-13-27(2,3)35)22(24)31-26(34)23-25(28)33-38-32-23/h7-10,17,29,35H,5-6,12,14-16H2,1-4H3,(H2,28,33)
n/an/a 6n/an/an/an/an/an/a
GlaxoSmithKline
Assay Description
IC50 is the inhibitor concentration, which inhibits 50% of kinase activity that catalyzes the transfer of the terminal phosphate from radiolabeled AT...
J Med Chem 51: 5663-79 (2008)
Article DOI: 10.1021/jm8004527
BindingDB Entry DOI: 10.7270/Q29G5K3H