BDBM25062 4-[(4-chlorophenyl)methyl]-6-{[(5Z)-4-oxo-2-sulfanylidene-1,3-thiazolidin-5-ylidene]methyl}-3,4-dihydro-2H-1,4-benzoxazin-3-one::benzo[1,4]oxazin-3-one, 10d
SMILES: Clc1ccc(CN2C(=O)COc3ccc(\C=C4/SC(=S)NC4=O)cc23)cc1
InChI Key: InChIKey=YRVMFJOMJPNPQU-PXNMLYILSA-N
Data: 2 IC50
Activity Spreadsheet -- Enzyme Inhibition Constant Data from BindingDB
Found 2 hits for monomerid = 25062
Trg + Lig
Ki
nM
ΔG°
kcal/mole
IC50
nM
Kd
nM
EC50/IC50
nM
koff
s-1
kon
M-1s-1
pHTemp
°C
Phosphatidylinositol 4,5-bisphosphate 3-kinase catalytic subunit gamma isoform
(Homo sapiens (Human))
BDBM25062
(4-[(4-chlorophenyl)methyl]-6-{[(5Z)-4-oxo-2-sulfan...)
Show SMILES Clc1ccc(CN2C(=O)COc3ccc(\C=C4/SC(=S)NC4=O)cc23)cc1
Show InChI InChI=1S/C19H13ClN2O3S2/c20-13-4-1-11(2-5-13)9-22-14-7-12(3-6-15(14)25-10-17(22)23)8-16-18(24)21-19(26)27-16/h1-8H,9-10H2,(H,21,24,26)/b16-8-
NCI pathway
Reactome pathway
n/an/a 30n/an/an/an/an/an/a
The University of Jordan
Curated by ChEMBL
Assay Description
Inhibition of PI3Kgamma (unknown origin) assessed as decrease in fluorescence intensity using phosphorylated substrate
Eur J Med Chem 84: 454-65 (2014)
Article DOI: 10.1016/j.ejmech.2014.07.056
BindingDB Entry DOI: 10.7270/Q2057HM8
Phosphoinositide 3-Kinase (PI3K), gamma
(Homo sapiens (Human))
BDBM25062
(4-[(4-chlorophenyl)methyl]-6-{[(5Z)-4-oxo-2-sulfan...)
Show SMILES Clc1ccc(CN2C(=O)COc3ccc(\C=C4/SC(=S)NC4=O)cc23)cc1
Show InChI InChI=1S/C19H13ClN2O3S2/c20-13-4-1-11(2-5-13)9-22-14-7-12(3-6-15(14)25-10-17(22)23)8-16-18(24)21-19(26)27-16/h1-8H,9-10H2,(H,21,24,26)/b16-8-
NCI pathway
Reactome pathway
n/an/a 7.16n/an/an/an/a7.430
Pfizer
Assay Description
PI3Kgamma activity was assessed by incubation of baculoviral co-expressed regulatory and catalytic subunits (p101 and p110) with lipid micelles prepa...
Bioorg Med Chem Lett 17: 756-60 (2007)
Article DOI: 10.1016/j.bmcl.2006.10.080
BindingDB Entry DOI: 10.7270/Q2NS0S6N