BDBM250652 US9447148, 9.21
SMILES: NC(=N)NCCC[C@@H]1NC(=O)[C@@H](Cc2ccccc2)NC(=O)[C@H](Cc2c[nH]cn2)NC(=O)[C@H](CCC(=O)NCC[C@H](NC1=O)C(=O)N[C@@H](Cc1c[nH]c2ccccc12)C(N)=O)NC(=O)CC1CCCC1
InChI Key:
Data: 2 KI  1 EC50
Activity Spreadsheet -- Enzyme Inhibition Constant Data from BindingDB
Found 3 hits for monomerid = 250652
Trg + Lig
Ki
nM
ΔG°
kcal/mole
IC50
nM
Kd
nM
EC50/IC50
nM
koff
s-1
kon
M-1s-1
pHTemp
°C
Melanocyte-stimulating hormone receptor
(Homo sapiens (Human))
BDBM250652
(US9447148, 9.21)
Show SMILES NC(=N)NCCC[C@@H]1NC(=O)[C@@H](Cc2ccccc2)NC(=O)[C@H](Cc2c[nH]cn2)NC(=O)[C@H](CCC(=O)NCC[C@H](NC1=O)C(=O)N[C@@H](Cc1c[nH]c2ccccc12)C(N)=O)NC(=O)CC1CCCC1 |r|
US Patent
0.0100 -15.6n/an/an/an/an/a7.537
Palatin Technologies, Inc.
US Patent
Assay Description
A competitive inhibition binding assay was performed using membrane homogenates prepared from HEK-293 cells that express recombinant hMCR-1a or hMCR-...
US Patent US9447148 (2016)
BindingDB Entry DOI: 10.7270/Q2RJ4HD2
Melanocortin receptor 4
(Homo sapiens (Human))
BDBM250652
(US9447148, 9.21)
Show SMILES NC(=N)NCCC[C@@H]1NC(=O)[C@@H](Cc2ccccc2)NC(=O)[C@H](Cc2c[nH]cn2)NC(=O)[C@H](CCC(=O)NCC[C@H](NC1=O)C(=O)N[C@@H](Cc1c[nH]c2ccccc12)C(N)=O)NC(=O)CC1CCCC1 |r|
US Patent
93 -9.97n/an/an/an/an/a7.537
Palatin Technologies, Inc.
US Patent
Assay Description
A competitive inhibition binding assay was performed using membrane homogenates prepared from HEK-293 cells that express recombinant hMCR-1a or hMCR-...
US Patent US9447148 (2016)
BindingDB Entry DOI: 10.7270/Q2RJ4HD2
Melanocyte-stimulating hormone receptor
(Homo sapiens (Human))
BDBM250652
(US9447148, 9.21)
Show SMILES NC(=N)NCCC[C@@H]1NC(=O)[C@@H](Cc2ccccc2)NC(=O)[C@H](Cc2c[nH]cn2)NC(=O)[C@H](CCC(=O)NCC[C@H](NC1=O)C(=O)N[C@@H](Cc1c[nH]c2ccccc12)C(N)=O)NC(=O)CC1CCCC1 |r|
US Patent
n/an/an/an/a 0.00400n/an/a7.537
Palatin Technologies, Inc.
US Patent
Assay Description
Accumulation of intracellular cAMP was examined as a measure of the ability of the peptides of the present invention to elicit a functional response ...
US Patent US9447148 (2016)
BindingDB Entry DOI: 10.7270/Q2RJ4HD2