BDBM25076 4-[2-(4-tert-butylphenyl)ethyl]-6-{[(5Z)-4-oxo-2-sulfanylidene-1,3-thiazolidin-5-ylidene]methyl}-3,4-dihydro-2H-1,4-benzoxazin-3-one::benzo[1,4]oxazin-3-one, 10r
SMILES: CC(C)(C)c1ccc(CCN2C(=O)COc3ccc(\C=C4/SC(=S)NC4=O)cc23)cc1
InChI Key: InChIKey=LSTPILCEEFKKAM-MOSHPQCFSA-N
Data: 2 IC50
Activity Spreadsheet -- Enzyme Inhibition Constant Data from BindingDB
Found 2 hits for monomerid = 25076
Trg + Lig
Ki
nM
ΔG°
kcal/mole
IC50
nM
Kd
nM
EC50/IC50
nM
koff
s-1
kon
M-1s-1
pHTemp
°C
Phosphatidylinositol 4,5-bisphosphate 3-kinase catalytic subunit gamma isoform
(Homo sapiens (Human))
BDBM25076
(4-[2-(4-tert-butylphenyl)ethyl]-6-{[(5Z)-4-oxo-2-s...)
Show SMILES CC(C)(C)c1ccc(CCN2C(=O)COc3ccc(\C=C4/SC(=S)NC4=O)cc23)cc1
Show InChI InChI=1S/C24H24N2O3S2/c1-24(2,3)17-7-4-15(5-8-17)10-11-26-18-12-16(6-9-19(18)29-14-21(26)27)13-20-22(28)25-23(30)31-20/h4-9,12-13H,10-11,14H2,1-3H3,(H,25,28,30)/b20-13-
NCI pathway
Reactome pathway
n/an/a 140n/an/an/an/an/an/a
The University of Jordan
Curated by ChEMBL
Assay Description
Inhibition of PI3Kgamma (unknown origin) assessed as decrease in fluorescence intensity using phosphorylated substrate
Eur J Med Chem 84: 454-65 (2014)
Article DOI: 10.1016/j.ejmech.2014.07.056
BindingDB Entry DOI: 10.7270/Q2057HM8
Phosphatidylinositol 4,5-bisphosphate 3-kinase catalytic subunit gamma isoform/Phosphoinositide 3-kinase regulatory subunit 5
(Homo sapiens (Human))
BDBM25076
(4-[2-(4-tert-butylphenyl)ethyl]-6-{[(5Z)-4-oxo-2-s...)
Show SMILES CC(C)(C)c1ccc(CCN2C(=O)COc3ccc(\C=C4/SC(=S)NC4=O)cc23)cc1
Show InChI InChI=1S/C24H24N2O3S2/c1-24(2,3)17-7-4-15(5-8-17)10-11-26-18-12-16(6-9-19(18)29-14-21(26)27)13-20-22(28)25-23(30)31-20/h4-9,12-13H,10-11,14H2,1-3H3,(H,25,28,30)/b20-13-
NCI pathway
Reactome pathway
n/an/a 33.2n/an/an/an/a7.430
Pfizer
Assay Description
PI3Kgamma activity was assessed by incubation of baculoviral co-expressed regulatory and catalytic subunits (p101 and p110) with lipid micelles prepa...
Bioorg Med Chem Lett 17: 756-60 (2007)
Article DOI: 10.1016/j.bmcl.2006.10.080
BindingDB Entry DOI: 10.7270/Q2NS0S6N