BDBM251 (S)-3-({5-[1-Carboxymethyl-3-(2-chloro-benzylsulfanyl)-2-oxo-propylcarbamoyl]thiophen-2-ylmethyl}sulfamoyl)-benzoic Acid::3-{[(5-{[(2S)-1-carboxy-4-{[(2-chlorophenyl)methyl]sulfanyl}-3-oxobutan-2-yl]carbamoyl}thiophen-2-yl)methyl]sulfamoyl}benzoic acid::Inhibitor 76::Thiophene Scaffold 76
SMILES: OC(=O)C[C@H](NC(=O)c1ccc(CNS(=O)(=O)c2cccc(c2)C(O)=O)s1)C(=O)CSCc1ccccc1Cl
InChI Key: InChIKey=MSOSPLTZVVLJDB-FQEVSTJZSA-N
Data: 1 KI
Activity Spreadsheet -- Enzyme Inhibition Constant Data from BindingDB
Found 1 hit for monomerid = 251
Trg + Lig
Ki
nM
ΔG°
kcal/mole
IC50
nM
Kd
nM
EC50/IC50
nM
koff
s-1
kon
M-1s-1
pHTemp
°C
Caspase-3
(Homo sapiens (Human))
BDBM251
((S)-3-({5-[1-Carboxymethyl-3-(2-chloro-benzylsulfa...)
Show SMILES OC(=O)C[C@H](NC(=O)c1ccc(CNS(=O)(=O)c2cccc(c2)C(O)=O)s1)C(=O)CSCc1ccccc1Cl |r|
Show InChI InChI=1S/C25H23ClN2O8S3/c26-19-7-2-1-4-16(19)13-37-14-21(29)20(11-23(30)31)28-24(32)22-9-8-17(38-22)12-27-39(35,36)18-6-3-5-15(10-18)25(33)34/h1-10,20,27H,11-14H2,(H,28,32)(H,30,31)(H,33,34)/t20-/m0/s1
NCI pathway
Reactome pathway
400 -8.72n/an/an/an/an/a7.425
Sunesis Pharmaceuticals
Assay Description
The effectiveness of compounds against the activity of human recombinant caspase-1-8 was measured using fluorometric assays. Assays were carried out ...
J Med Chem 45: 5005-22 (2002)
Article DOI: 10.1021/jm020230j
BindingDB Entry DOI: 10.7270/Q2B56GW5