null
SMILES: COc1cc2c(N)nc(nc2c(F)c1OC)N1CCN(CC1)C(=O)C[C@@H](N)c1ccc(F)cc1
InChI Key: InChIKey=JIBSJZSTMKHSTK-MRXNPFEDSA-N
Activity Spreadsheet -- Enzyme Inhibition Constant Data from BindingDB
Found 1 hit for monomerid = 251366
Trg + Lig
Ki
nM
ΔG°
kcal/mole
IC50
nM
Kd
nM
EC50/IC50
nM
koff
s-1
kon
M-1s-1
pHTemp
°C
Cobra venom factor/Complement factor B/Complement factor D
(Naja kaouthia (Monocled cobra) (Naja siamensis)-Ho...)
BDBM251366
(US9452990, 46)
Show SMILES COc1cc2c(N)nc(nc2c(F)c1OC)N1CCN(CC1)C(=O)C[C@@H](N)c1ccc(F)cc1 |r|
Show InChI InChI=1S/C23H26F2N6O3/c1-33-17-11-15-20(19(25)21(17)34-2)28-23(29-22(15)27)31-9-7-30(8-10-31)18(32)12-16(26)13-3-5-14(24)6-4-13/h3-6,11,16H,7-10,12,26H2,1-2H3,(H2,27,28,29)/t16-/m1/s1
US Patent
n/an/a 40n/an/an/an/a7.425
NOVARTIS AG
US Patent
Assay Description
CVF-Bb complex prepared from purified cobra venom factor (1 μM), recombinant human complement factor B (expressed in drosophila cells and purifi...
US Patent US9452990 (2016)
BindingDB Entry DOI: 10.7270/Q2H130Z9