null
SMILES: CCN[C@H](CC(=O)N1CCN(CC1)c1nc(N)c2cc(OC)c(OC)c(F)c2n1)c1ccc(cc1)C#N
InChI Key: InChIKey=FQQPKJKIBNLDSF-LJQANCHMSA-N
Activity Spreadsheet -- Enzyme Inhibition Constant Data from BindingDB
Found 2 hits for monomerid = 251408
Trg + Lig
Ki
nM
ΔG°
kcal/mole
IC50
nM
Kd
nM
EC50/IC50
nM
koff
s-1
kon
M-1s-1
pHTemp
°C
Complement factor B
(Homo sapiens (Human))
BDBM251408
(US9452990, 90)
Show SMILES CCN[C@H](CC(=O)N1CCN(CC1)c1nc(N)c2cc(OC)c(OC)c(F)c2n1)c1ccc(cc1)C#N |r|
Show InChI InChI=1S/C26H30FN7O3/c1-4-30-19(17-7-5-16(15-28)6-8-17)14-21(35)33-9-11-34(12-10-33)26-31-23-18(25(29)32-26)13-20(36-2)24(37-3)22(23)27/h5-8,13,19,30H,4,9-12,14H2,1-3H3,(H2,29,31,32)/t19-/m1/s1
n/an/a 1n/an/an/an/an/an/a
The University of Queensland
Curated by ChEMBL
Assay Description
Inhibition of recombinant human factor B expressed in drosophila cells assessed as decrease in C3a formation using CVF-Bb complex and human complemen...
J Med Chem 61: 3253-3276 (2018)
Article DOI: 10.1021/acs.jmedchem.7b00882
BindingDB Entry DOI: 10.7270/Q2MK6GJ9
Cobra venom factor/Complement factor B/Complement factor D
(Naja kaouthia (Monocled cobra) (Naja siamensis)-Ho...)
BDBM251408
(US9452990, 90)
Show SMILES CCN[C@H](CC(=O)N1CCN(CC1)c1nc(N)c2cc(OC)c(OC)c(F)c2n1)c1ccc(cc1)C#N |r|
Show InChI InChI=1S/C26H30FN7O3/c1-4-30-19(17-7-5-16(15-28)6-8-17)14-21(35)33-9-11-34(12-10-33)26-31-23-18(25(29)32-26)13-20(36-2)24(37-3)22(23)27/h5-8,13,19,30H,4,9-12,14H2,1-3H3,(H2,29,31,32)/t19-/m1/s1
US Patent
n/an/a 1n/an/an/an/a7.425
NOVARTIS AG
US Patent
Assay Description
CVF-Bb complex prepared from purified cobra venom factor (1 μM), recombinant human complement factor B (expressed in drosophila cells and purifi...
US Patent US9452990 (2016)
BindingDB Entry DOI: 10.7270/Q2H130Z9